program: Gaussian 09
title: 000238519
version: EM64L-G09RevD.01
frameworkgroup: C1[X(C19H18N2)]
method: RPBEPBE
basis: SDD
operation: Freq
keyword: #pfreq=noraman
keyword: PBEPBE/SDD
title: #p freq=noraman PBEPBE/SDD
converged: YES YES NO NO
title: Mulliken charges:
elementType: N N C C C C C C C C C C C C C C C C C C C H H H H H H H H H H H H H H H H H H
charge: -0.052417 0.014697 -0.160068 -0.617323 -0.617314 0.286408 0.509451 0.508455 -0.419425 -0.414678 -0.412363 -0.416769 -0.418015 -0.227349 -0.230611 -0.231308 -0.227725 -0.242026 -0.241940 -0.311858 -0.249066 0.242733 0.214184 0.240365 0.239295 0.214538 0.241090 0.228903 0.228525 0.241143 0.248323 0.223858 0.223205 0.223230 0.224051 0.227644 0.227746 0.239204 0.243208
chargesum: 0.00000
title: Mulliken charges with hydrogens summed into heavy atoms:
elementType: N N C C C C C C C C C C C C C C C C C C C
charge: -0.052417 0.014697 0.082665 -0.162774 -0.163481 0.286408 0.509451 0.508455 -0.178335 -0.185775 -0.183839 -0.175626 -0.169692 -0.003491 -0.007406 -0.008078 -0.003673 -0.014382 -0.014194 -0.072654 -0.005858
polarizability: 2.24695564e+02 -5.42326979e-01 2.15474137e+02 -7.25754276e-01 2.02603357e+01 1.62340694e+02
1716.lowfreq: -9.7416 -6.2788 -0.0006 0.0001 0.0004 5.6225 19.4293 24.3260 26.6278
frequency: 17.3556 23.9113 26.5238 30.1314 39.0629 42.1112 102.2880 112.5103 171.3680 191.0131 205.3213 218.8688 338.1097 343.3237 347.8195 402.7932 402.9314 406.8561 407.3580 491.2266 505.6946 533.5694 583.0398 595.9535 604.1031 617.2891 617.5768 619.9607 706.6709 707.0154 751.3425 760.7374 770.1303 787.6578 792.8648 833.6540 847.6859 855.5896 856.1121 895.2285 915.7282 927.0667 935.7151 958.2532 966.2743 977.5610 978.1876 984.9492 990.0412 990.2237 995.3229 995.7002 1012.3747 1021.0191 1026.8042 1029.4283 1044.5238 1078.8566 1083.6853 1143.2335 1154.2428 1171.2707 1172.0454 1177.3073 1187.0867 1187.5629 1214.4924 1219.7523 1225.5447 1242.7411 1252.3891 1290.9940 1308.9124 1320.6226 1328.7147 1332.0746 1355.7865 1381.4299 1383.0037 1397.4712 1439.8722 1440.8729 1442.5446 1466.2712 1478.2194 1482.5835 1483.5467 1504.0163 1535.8236 1592.0422 1592.7168 1613.9692 1614.3112 2984.9298 2988.1469 2997.7574 3050.4887 3056.9711 3110.1358 3110.6929 3119.7287 3119.8266 3128.2678 3132.3825 3132.5455 3138.9980 3143.1994 3143.4917 3156.6825 3161.9032 3162.2406
redmass: 5.0990 3.9993 6.0142 4.0458 4.5877 5.1017 3.6943 4.5623 5.0354 5.1577 4.0334 4.6834 2.3326 2.0472 3.2780 2.8654 2.8617 4.1749 4.6236 4.0925 3.1164 4.9633 4.4624 5.4215 3.1793 6.2546 6.2886 4.9355 1.7233 1.8740 1.8451 2.2946 2.3819 4.1959 3.2357 3.9854 1.4720 1.2613 1.2506 1.6302 1.4619 1.4862 1.4835 1.4708 2.7869 1.4619 1.4377 2.7074 6.2739 6.2665 1.3468 1.3240 3.5605 3.0975 2.1832 2.3291 2.7944 1.6561 1.6281 1.9003 1.1279 1.0920 1.0515 1.4356 1.1193 1.1235 2.5685 2.1396 2.1408 4.6238 1.2385 1.6483 1.3283 1.3460 1.2522 1.3071 1.4046 8.0007 6.2909 1.8861 2.1440 2.1038 1.9965 1.1242 1.2127 2.2719 2.0637 7.5073 4.7926 6.0314 5.9858 6.1565 6.1493 1.0614 1.0607 1.0839 1.1014 1.1007 1.0874 1.0874 1.0861 1.0862 1.0882 1.0911 1.0911 1.0921 1.0959 1.0959 1.0994 1.1015 1.1014
irintensity: 0.0024 0.0253 0.2045 0.0473 0.1208 0.0645 0.0188 0.9510 0.4723 0.2860 0.0609 1.0053 0.7707 0.0094 0.4892 0.6035 0.1135 6.1544 13.0881 13.7990 20.6083 0.0016 2.0430 1.2124 10.2895 0.0710 0.1420 0.9168 37.2129 64.0944 68.4818 26.4412 3.2993 6.2437 1.3126 2.2890 20.8364 0.7080 0.3798 0.6176 2.6100 2.8420 0.9392 0.0425 2.6464 0.5448 0.4113 11.5617 0.0406 0.0200 1.5562 0.7511 0.4724 6.0108 2.5790 5.4200 6.3804 0.2183 19.4645 7.8212 2.6537 0.6510 0.0679 4.2494 0.1121 1.1882 0.0119 2.9748 4.1733 1.1540 8.1612 7.4979 0.3199 7.1361 0.0391 2.0016 2.0178 0.0468 2.0894 21.1205 0.3001 23.0497 8.3362 0.0909 23.2398 34.0090 1.5698 4.9286 9.4858 0.2433 2.9112 17.8580 1.9385 1.7361 61.5851 13.7368 0.9212 22.8157 12.7126 8.9636 4.0023 3.2411 4.6119 13.9223 9.8400 17.4261 26.5078 60.1201 35.4408 30.2184 18.2682
temp: 298.150 k
press: 1.00000 atm
elementType: 7 7 6 6 6 6 6 6 6 6 6 6 6 6 6 6 6 6 6 6 6 1 1 1 1 1 1 1 1 1 1 1 1 1 1 1 1 1 1
symmnumber: 1
zpe: 834074.3 jmol-1
zpe.correction: 0.317682 hartree
zpe.thermalcorrener: 0.335454 hartree
zpe.thermalcorrenthalpy: 0.336398 hartree
zpe.thermalcorrgfe: 0.267485 hartree
zpe.sumelectzpe: -842.841418 hartree
zpe.sumelectthermal: -842.823647 hartree
zpe.sumelectthermalent: -842.822703 hartree
zpe.sumelectthermalfe: -842.891616 hartree
dipole: 0.0087 -0.3796 0.5193
dipole: 0.6433
quadrupole: -120.2420 -109.7928 -128.2273
quadrupole: -0.1614 0.0108 9.3479
quadrupole: -0.8213 9.6279 -8.8066 -0.1614 0.0108 9.3479
hfenergy: -843.1591006 hartree
pointgroup: C01 [X(C19H18N2)]
dipole: 0.0129727 0.1443978 -0.2074548 debye
polarizability: 224.7193653|-0.0194343|216.2904979|2.0874205|19.0104623|161.5005317 unknown
InChI: InChI=1S/C19H18N2/c1-3-7-16(8-4-1)13-18(19-15-20-11-12-21-19)14-17-9-5-2-6-10-17/h1-12,15,18H,13-14H2
charge 0 multiplicity 1
39 atoms
N  -0.107396 -1.715626 -1.096116
N  -0.107438 -2.409465 1.669867
C  0.050657 0.695265 -0.587119
C  -1.208596 1.081404 -1.431998
C  1.35146 0.934798 -1.424473
C  -0.033757 -0.749255 -0.123492
C  -2.499819 1.06559 -0.627571
C  2.628542 0.758845 -0.617103
C  -3.396712 -0.031089 -0.701201
C  3.096404 1.79962 0.227597
C  -2.821872 2.144013 0.238096
C  3.365273 -0.452672 -0.665825
C  -0.035933 -1.112524 1.248303
C  -4.581819 -0.051533 0.069265
C  4.264692 1.635141 1.004654
C  -4.004372 2.128182 1.010446
C  4.535021 -0.622193 0.109467
C  -4.889669 1.027725 0.929003
C  4.988344 0.420863 0.94938
C  -0.179962 -3.01215 -0.680646
C  -0.179514 -3.359688 0.691272
H  0.085818 1.344778 0.310045
H  -1.033862 2.093659 -1.847013
H  -1.271161 0.377767 -2.282541
H  1.332579 0.236106 -2.281509
H  1.29947 1.963807 -1.831593
H  -3.162617 -0.870141 -1.36759
H  2.546115 2.748742 0.26845
H  -2.145319 3.006576 0.299087
H  3.019794 -1.263359 -1.318818
H  0.021787 -0.348482 2.030636
H  -5.26395 -0.906511 -0.001712
H  4.613765 2.451568 1.647355
H  -4.239007 2.97191 1.66962
H  5.092252 -1.564546 0.057298
H  -5.808694 1.013623 1.525601
H  5.895659 0.291671 1.550004
H  -0.238232 -3.778568 -1.461382
H  -0.236832 -4.403056 1.018553
