program: Gaussian 09
title: 000238502
version: EM64L-G09RevD.01
frameworkgroup: C1[X(C9H12N2O)]
method: RPBEPBE
basis: SDD
operation: Freq
keyword: #p
keyword: freq=noraman
keyword: PBEPBE/SDD
title: #p freq=noraman PBEPBE/SDD
converged: YES YES NO NO
title: Mulliken charges:
elementType: O N N C C C C C C C C C H H H H H H H H H H H H
charge: -0.190779 -0.021604 0.016430 -0.156749 0.217928 -0.608440 -0.692992 -0.695960 0.236522 -0.393607 -0.294787 -0.249463 0.260411 0.237329 0.244800 0.229269 0.229077 0.216533 0.232880 0.208792 0.222886 0.260024 0.243767 0.247733
chargesum: 0.00000
title: Mulliken charges with hydrogens summed into heavy atoms:
elementType: O N N C C C C C C C C C
charge: -0.190779 -0.021604 0.016430 0.103662 0.217928 -0.126311 -0.018112 -0.031402 0.236522 -0.133583 -0.051020 -0.001730
polarizability: 1.39591775e+02 7.43272379e+00 1.10574711e+02 -1.03859194e+01 2.64942725e+00 8.09586764e+01
1716.lowfreq: -8.2838 -3.3079 -0.0003 0.0001 0.0006 7.4403 29.0424 40.9049 49.5575
frequency: 29.0174 40.7710 49.4895 81.8057 181.6059 188.5176 205.7010 214.2729 277.9402 291.6615 355.6997 400.6507 421.0632 467.3086 537.0682 584.2599 621.8777 717.6773 724.1813 770.3090 824.3477 856.9644 888.1223 915.7973 928.3903 939.7435 959.0875 962.5109 974.9563 1033.6123 1041.0195 1091.0862 1116.4552 1145.7164 1167.9027 1185.4785 1231.1618 1242.5331 1261.1821 1290.8459 1310.6469 1349.4752 1377.9398 1387.7938 1396.2296 1438.3047 1445.7963 1465.0606 1467.3582 1479.3798 1487.0413 1499.1225 1530.6348 1629.9897 2981.3703 2985.8140 2989.3981 3027.8997 3078.4966 3084.7760 3086.1368 3095.2487 3103.9394 3137.0359 3146.1237 3163.8181
redmass: 5.3896 3.1748 3.8551 5.7645 3.6744 1.0636 3.3360 1.1705 2.7309 3.4318 2.2200 3.8172 2.2124 5.8220 5.4156 4.5272 6.2851 3.0703 4.2164 2.6218 2.5367 2.1689 2.4483 1.7730 1.2288 1.5448 1.4714 1.5033 4.3700 2.9268 2.3185 1.5729 2.4654 2.0500 1.7062 1.7882 3.2394 2.2541 1.7569 1.3391 1.3610 1.5782 1.2112 1.8181 1.2042 1.9232 1.1061 1.0458 1.0483 1.0498 1.0662 7.3935 4.7008 8.6179 1.0348 1.0803 1.0382 1.0578 1.1000 1.1007 1.1002 1.0996 1.1051 1.0883 1.0925 1.0995
irintensity: 0.7239 1.3998 1.5424 0.8122 1.3157 0.0593 0.8872 0.8020 0.3171 5.9399 0.8647 18.5002 3.6067 2.9600 2.7086 4.4164 3.3466 2.9910 0.5217 10.6353 10.4563 7.6651 2.8488 12.7246 3.3810 3.1403 0.0184 1.6038 8.4293 2.3827 72.3081 9.4831 16.8157 88.1370 3.1057 57.5241 6.0940 9.2501 23.8630 23.7195 12.4372 23.7313 17.4587 31.9241 25.0613 48.7766 12.8245 8.7161 2.0079 15.0394 20.7518 19.4336 16.0089 130.5507 30.9110 3.6923 23.3752 9.8802 31.9795 17.9286 33.0709 28.6524 5.7682 2.6577 17.4528 31.6413
temp: 298.150 k
press: 1.00000 atm
elementType: 8 7 7 6 6 6 6 6 6 6 6 6 1 1 1 1 1 1 1 1 1 1 1 1
symmnumber: 1
zpe: 510581.9 jmol-1
zpe.correction: 0.194470 hartree
zpe.thermalcorrener: 0.206574 hartree
zpe.thermalcorrenthalpy: 0.207518 hartree
zpe.thermalcorrgfe: 0.154528 hartree
zpe.sumelectzpe: -533.963778 hartree
zpe.sumelectthermal: -533.951675 hartree
zpe.sumelectthermalent: -533.950731 hartree
zpe.sumelectthermalfe: -534.003721 hartree
dipole: -0.0022 -2.5808 -1.7393
dipole: 3.1122
quadrupole: -71.7720 -72.9083 -72.8840
quadrupole: 1.7937 -2.2177 -6.0626
quadrupole: 0.7494 -0.3869 -0.3626 1.7937 -2.2177 -6.0626
hfenergy: -534.1582485 hartree
pointgroup: C01 [X(C9H12N2O1)]
dipole: 0.0005906 0.5152043 1.1107815 debye
dipolederiv: -0.5919669 -0.025308 0.1180079 -0.0914536 -0.4777671 -0.2135175 0.4033014 -0.2511939 -0.7214228 -0.3743853 0.0215064 -0.0040978 0.2023447 -0.2705072 0.0080663 0.1453346 -0.0294747 -0.2729097 -0.195804 -0.0534865 -0.0003 -0.1186115 -0.146683 0.0397282 -0.0523761 0.0422487 -0.2201585 -0.1562198 -0.1443844 -0.1168701 -0.1581246 -0.0276545 -0.097205 -0.082879 -0.1598908 -0.1167614 1.1261783 0.2266577 -0.226108 0.6501474 0.4242188 0.3292176 -0.6662962 0.3925243 0.7663052 -0.909797 0.1262393 0.2224174 -0.0249579 0.0045979 0.0242514 0.217737 0.0398953 -0.0216257 0.087184 0.0024331 -0.0121992 -0.0949307 0.0034143 -0.0207668 0.0025741 0.0619051 0.0605203 0.0103061 -0.0076425 0.0314991 -0.0477878 0.028688 0.0643048 -0.0284119 0.0480886 -0.0009869 0.7675212 -0.3886858 -0.0440087 -0.500628 0.1230761 0.016923 0.2270008 -0.2060267 -0.0042226 -0.2556905 0.2045878 0.0607753 0.0170744 0.1337927 0.0548244 -0.1882245 0.2662941 0.0999665 -0.0365646 0.123737 0.0583935 -0.1525339 0.220213 0.1004318 -0.1803439 0.2538727 0.1238323 0.1889856 -0.2537848 -0.0186828 0.0475818 -0.0157742 -0.0234204 0.1647531 -0.1748635 -0.0495312 0.0405218 0.053006 0.0491553 0.0513755 0.021775 -0.0178526 0.0752868 0.0039948 0.0289675 0.1156912 0.0285422 -0.0537326 0.0235399 0.0807896 -0.0251109 -0.0713255 0.026558 -0.056154 0.045076 -0.0603302 -0.0126763 -0.0215322 -0.0615979 -0.0103236 -0.0133383 -0.0737392 0.0712825 -0.0379305 0.0809935 0.0176802 0.1092248 0.0242322 -0.0369066 0.0944521 -0.0792898 0.0235207 -0.0219199 -0.0722584 -0.0892067 -0.0957812 -0.0358059 -0.0885886 -0.0860982 -0.0679853 0.0340497 0.0433768 -0.0657281 0.1061071 -0.0471147 -0.0011252 0.1202429 0.0800188 0.1120986 -0.0439186 0.0092975 0.0500893 0.0714506 0.1200045 0.021732 -0.0750005 0.0875517 -0.0217874 0.0407061 -0.0058398 -0.1118025 -0.0358327 -0.134703 -0.0484981 -0.0537836 -0.0596509 -0.0941694 0.0299222 -0.0097671 0.080627 -0.1046198 0.053714 0.0380841 0.0705308 -0.075147 0.090183 -0.0259651 0.0997531 0.0379872 0.0041837 0.0511438 -0.0234126 -0.0642115 0.0143035 -0.0761293 0.0780762 0.0884078 0.0231692 -0.0068658 0.0706325 -0.0466702 -0.0893213 0.0241075 -0.1085053 0.0587091 -0.0264141 0.1238353 -0.0144694 0.091376 0.0308824 -0.0125121 -0.0323303 0.0053922 0.1177983 unknown
polarizability: 136.8425654|-15.3261443|102.5717389|7.9494869|13.2909939|91.7108576 unknown
InChI: InChI=1S/C9H12N2O/c1-7(2)9(12)5-8-6-10-3-4-11-8/h3-4,6-7H,5H2,1-2H3
charge 0 multiplicity 1
24 atoms
O  1.938551 -1.45371 -1.50433
N  -0.892772 0.488694 0.942041
N  -2.86036 -0.252299 -0.988897
C  2.437508 0.20155 0.243639
C  1.656765 -0.957717 -0.383692
C  0.463937 -1.515336 0.436451
C  3.447997 -0.38824 1.275173
C  3.158927 1.050354 -0.822311
C  -0.769302 -0.663106 0.206276
C  -1.756046 -1.018641 -0.755264
C  -1.99706 1.256116 0.708414
C  -2.974495 0.890861 -0.247055
H  1.706721 0.820511 0.802878
H  0.708002 -1.493337 1.512313
H  0.279327 -2.552927 0.11313
H  4.195496 -1.02268 0.765447
H  3.981532 0.436102 1.780618
H  2.948542 -0.994084 2.053165
H  3.850707 0.425313 -1.413229
H  3.736039 1.860575 -0.34117
H  2.440357 1.507147 -1.525933
H  -1.658877 -1.933192 -1.349259
H  -2.093114 2.17243 1.300206
H  -3.858283 1.510515 -0.42871
