program: Gaussian 09
title: 000238510
version: EM64L-G09RevD.01
frameworkgroup: C1[X(C11H16O5)]
method: RPBEPBE
basis: SDD
operation: Freq
keyword: #pfreq=noraman
keyword: PBEPBE/SDD
title: #p freq=noraman PBEPBE/SDD
converged: YES YES NO NO
title: Mulliken charges:
elementType: O O O O O C C C C C C C C C C C H H H H H H H H H H H H H H H H
charge: -0.180214 -0.156186 -0.233388 -0.133160 -0.205022 -0.047281 -0.499282 -0.688747 -0.696724 0.198783 -0.585811 0.154173 0.020438 0.196470 -0.258418 -0.654917 0.216643 0.250051 0.239751 0.219700 0.219454 0.214301 0.221903 0.218576 0.211638 0.282473 0.287531 0.233916 0.240655 0.222522 0.256782 0.233392
chargesum: 0.00000
title: Mulliken charges with hydrogens summed into heavy atoms:
elementType: O O O O O C C C C C C C C C C C
charge: -0.180214 -0.156186 -0.233388 -0.133160 -0.205022 0.169363 -0.009481 -0.035292 -0.044608 0.198783 -0.015807 0.154173 0.020438 0.196470 0.216153 0.057778
polarizability: 1.73340567e+02 1.00712475e+01 1.27208884e+02 -8.45723398e-01 -2.60930796e-01 1.16412858e+02
1716.lowfreq: -13.3048 -7.8505 -4.9659 0.0004 0.0009 0.0010 7.2744 13.4281 31.4457
frequency: -7.3497 11.7837 31.4313 39.2102 47.0332 60.7535 68.4950 82.3478 121.8474 149.0248 165.3732 193.0959 208.7534 213.0147 229.8500 242.8695 290.7740 302.2612 306.0501 352.8272 388.4306 405.7984 429.3968 434.9086 494.8386 509.5775 555.0855 623.6606 693.2238 734.4367 749.4963 768.8163 810.3288 818.4832 838.1877 894.4009 916.1613 924.3184 947.1950 949.3186 963.0142 1000.1085 1066.5485 1095.3204 1097.5833 1123.5249 1155.4710 1158.9773 1170.4735 1197.8989 1226.1963 1241.5744 1271.1282 1272.2217 1302.1727 1318.7253 1331.1236 1349.0303 1382.4858 1395.6814 1400.8433 1415.9783 1443.6612 1459.9824 1462.4684 1464.1819 1471.7041 1482.4757 1482.8380 1483.7227 1590.2070 1610.7549 1612.7225 1629.7264 2962.6685 2972.6897 2975.5943 2985.4736 2991.5667 2998.0193 3038.0036 3051.8425 3063.2520 3065.8408 3072.0628 3075.1525 3079.8648 3093.7096 3102.2435 3129.0162
redmass: 4.4329 4.5609 5.1352 3.7229 3.5863 3.9252 4.6198 4.7863 4.6102 3.4316 3.1159 3.0082 1.0858 1.6168 5.0868 1.2185 2.7473 2.7930 6.2491 2.1722 3.7145 4.4066 2.4454 3.3155 4.3907 6.2614 2.9934 6.2611 5.2998 4.8380 4.0203 3.4054 2.7184 1.5325 3.6203 1.5389 1.5041 1.7000 2.3022 2.7193 1.6498 2.6093 1.8352 2.2713 2.2630 2.7397 1.6579 1.6393 1.8286 1.7963 4.7329 1.6995 1.1404 1.3300 1.8421 1.5446 1.3390 1.2963 1.2039 1.2224 1.2070 1.0923 1.0904 1.0753 1.0623 1.0452 1.0528 1.0532 1.0468 1.0544 10.7142 12.4862 10.4409 10.4948 1.0819 1.0353 1.0366 1.0605 1.0590 1.0364 1.0602 1.0986 1.0997 1.0999 1.0994 1.0998 1.0992 1.0974 1.1028 1.1069
irintensity: 0.5176 0.8455 0.5948 0.0670 0.1684 4.3926 3.9885 0.3848 0.6806 0.5539 3.1016 5.2457 1.0179 10.0059 7.8840 1.4176 20.2507 1.0502 8.3720 0.9007 0.3430 9.9545 2.2774 3.9096 12.3519 31.1485 1.3039 47.3432 8.3922 5.4719 4.3250 15.3028 6.7401 3.4327 5.9121 5.4452 5.0387 1.9268 19.7436 131.5392 5.5317 107.1663 59.0509 59.1128 17.0893 33.5225 19.5336 33.5795 11.7669 31.3541 123.5755 73.7138 8.7913 8.2868 98.2956 5.8529 5.7449 0.4496 18.5242 24.3886 12.0009 39.9751 16.3982 20.5833 8.8311 0.3116 8.8753 7.1201 27.1348 10.2499 100.0997 127.8715 141.0228 180.1158 34.7018 33.7585 16.3468 8.2048 5.0950 13.1486 25.9585 1.7362 1.2211 18.7235 45.6797 37.1194 58.9751 30.5567 2.1013 22.4777
temp: 298.150 k
press: 1.00000 atm
elementType: 8 8 8 8 8 6 6 6 6 6 6 6 6 6 6 6 1 1 1 1 1 1 1 1 1 1 1 1 1 1 1 1
symmnumber: 1
zpe: 662673.7 jmol-1
zpe.correction: 0.252399 hartree
zpe.thermalcorrener: 0.270607 hartree
zpe.thermalcorrenthalpy: 0.271552 hartree
zpe.thermalcorrgfe: 0.203019 hartree
zpe.sumelectzpe: -803.610743 hartree
zpe.sumelectthermal: -803.592535 hartree
zpe.sumelectthermalent: -803.591590 hartree
zpe.sumelectthermalfe: -803.660123 hartree
dipole: 2.1393 3.8374 0.3454
dipole: 4.4070
quadrupole: -91.5964 -96.9292 -102.2405
quadrupole: 1.0558 -5.3096 -4.1280
quadrupole: 5.3257 -0.0071 -5.3185 1.0558 -5.3096 -4.1280
hfenergy: -803.863142 hartree
pointgroup: C01 [X(C11H16O5)]
dipole: -1.0361226 -1.1871019 0.7234789 debye
polarizability: 174.5732661|6.2096313|123.7883455|3.1885844|-3.3521838|118.6006976 unknown
InChI: InChI=1S/C11H16O5/c1-4-16-11(15)10(14)9(13)6-8(12)5-7(2)3/h7H,4-6H2,1-3H3
charge 0 multiplicity 1
32 atoms
O  4.447474 2.148132 -1.41443
O  0.491881 1.330793 -1.906939
O  -2.276936 1.060857 0.208091
O  -0.020555 2.901575 1.225204
O  -2.285575 2.948363 -1.186941
C  2.7977 0.014179 0.949443
C  3.225252 0.227607 -0.535067
C  3.856993 0.577257 1.925693
C  2.545707 -1.48972 1.206993
C  3.381802 1.687515 -0.936356
C  2.183522 2.64621 -0.69783
C  0.80486 2.071593 -0.937323
C  -0.290329 2.414069 0.102127
C  -1.727493 2.172115 -0.379583
C  -3.685534 0.701512 -0.198129
C  -3.667948 -0.140754 -1.474298
H  1.841532 0.55035 1.128473
H  2.465123 -0.230241 -1.200025
H  4.190098 -0.275793 -0.726344
H  4.034531 1.657963 1.771347
H  3.53691 0.434654 2.973658
H  4.824547 0.058124 1.789877
H  2.225165 -1.659497 2.251082
H  1.760358 -1.889435 0.539065
H  3.468946 -2.075769 1.037561
H  2.328577 3.505831 -1.379954
H  2.235321 3.042099 0.335627
H  -4.059979 0.14327 0.673478
H  -4.254872 1.637982 -0.329024
H  -4.698021 -0.46272 -1.714619
H  -3.280051 0.439434 -2.327735
H  -3.045606 -1.042051 -1.344019
