program: Gaussian 09
title: 000238499
version: EM64L-G09RevD.01
frameworkgroup: C1[X(C8H15NO2)]
method: RPBEPBE
basis: SDD
operation: Freq
keyword: #p
keyword: freq=noraman
keyword: PBEPBE/SDD
title: #p freq=noraman PBEPBE/SDD
converged: YES YES NO NO
title: Mulliken charges:
elementType: O O N C C C C C C C C H H H H H H H H H H H H H H H
charge: -0.245899 -0.215334 -0.092492 -0.331067 -0.346715 -0.336854 -0.323798 -0.319859 -0.506838 0.224615 -0.770977 0.189922 0.206240 0.215587 0.192790 0.188728 0.244980 0.190705 0.214148 0.214808 0.192879 0.231011 0.252307 0.239729 0.257400 0.233984
chargesum: 0.00000
title: Mulliken charges with hydrogens summed into heavy atoms:
elementType: O O N C C C C C C C C
charge: -0.245899 -0.215334 -0.092492 0.065095 0.061662 0.096854 0.081056 0.087828 -0.023520 0.224615 -0.039864
polarizability: 1.16193868e+02 -2.26074793e+00 9.98712257e+01 -1.23276394e+00 -7.74567666e-01 7.56377936e+01
1716.lowfreq: -3.7867 -0.0009 -0.0007 -0.0007 8.9378 15.8324 34.5481 51.1552 84.5920
frequency: 33.6847 51.0481 84.5625 93.0481 116.8652 178.3803 215.7858 239.3201 288.2968 312.4166 393.4411 432.8669 448.3882 469.1289 474.6826 559.2563 611.7368 752.1302 761.9253 807.5283 832.4998 843.5480 896.8160 936.8280 948.1070 1003.8455 1028.4599 1052.5556 1061.9368 1071.2917 1092.0517 1110.1230 1134.6896 1146.6176 1175.3672 1190.9159 1199.0551 1241.9736 1267.5033 1288.6967 1296.1360 1307.3225 1331.6494 1345.6509 1365.4287 1368.2476 1372.6492 1392.1474 1433.7945 1443.2058 1444.0717 1449.2383 1452.2470 1456.3136 1459.7225 1476.2121 1635.7798 2856.2277 2859.8852 2874.5562 2953.3067 2957.8352 2967.5197 2980.1516 3021.9919 3027.4080 3034.2084 3050.1432 3066.0728 3079.2202 3083.5593 3120.9725
redmass: 4.3714 3.3488 3.4056 1.6255 1.3955 2.9257 5.1310 1.8142 3.1192 2.3469 1.8752 2.8523 4.3634 2.5462 2.6658 3.3558 2.1368 2.2963 1.6163 3.9480 2.5292 1.7304 2.2905 1.4164 2.0402 2.5116 2.1756 2.3538 2.0989 2.3880 3.5634 2.2182 2.3750 2.5427 2.1048 1.0981 1.4306 1.2854 1.2740 1.2514 1.3354 1.5391 1.3093 1.2784 1.4197 1.2596 1.2726 1.4757 1.0940 1.0657 1.0817 1.0810 1.0954 1.0583 1.0946 1.0922 7.5378 1.0709 1.0706 1.0691 1.0665 1.0665 1.0606 1.0389 1.0937 1.0895 1.0891 1.0901 1.0950 1.0962 1.0977 1.1004
irintensity: 5.8000 0.6584 1.9145 0.4001 0.2515 10.3119 1.4922 2.2642 1.2713 14.9997 0.2471 10.2545 2.3753 1.1684 2.6433 1.4523 11.1199 2.7064 5.4795 17.7169 4.1233 1.1755 15.4807 2.1665 16.6120 19.2637 9.5865 28.8094 2.3582 4.3272 47.6911 2.5147 61.7262 8.5296 27.3781 2.1343 8.9655 47.7821 8.7514 27.2739 9.9658 35.6997 16.7001 18.2773 6.0147 64.7448 5.1747 22.4661 17.1064 17.3275 2.4203 0.6999 21.8041 17.1788 2.5174 13.3134 105.5319 44.2141 37.4949 168.9012 40.1708 98.1234 14.2505 6.1217 6.0249 43.3884 40.0678 26.6036 15.0174 40.9838 35.2805 14.6865
temp: 298.150 k
press: 1.00000 atm
elementType: 8 8 7 6 6 6 6 6 6 6 6 1 1 1 1 1 1 1 1 1 1 1 1 1 1 1
symmnumber: 1
zpe: 585035.2 jmol-1
zpe.correction: 0.222828 hartree
zpe.thermalcorrener: 0.234748 hartree
zpe.thermalcorrenthalpy: 0.235692 hartree
zpe.thermalcorrgfe: 0.183711 hartree
zpe.sumelectzpe: -518.119446 hartree
zpe.sumelectthermal: -518.107526 hartree
zpe.sumelectthermalent: -518.106582 hartree
zpe.sumelectthermalfe: -518.158563 hartree
dipole: -1.0777 2.5469 -0.4428
dipole: 2.8008
quadrupole: -79.3005 -65.0766 -67.0734
quadrupole: -12.6778 -0.3519 1.1854
quadrupole: -8.8170 5.4069 3.4101 -12.6778 -0.3519 1.1854
hfenergy: -518.342274 hartree
pointgroup: C01 [X(C8H15N1O2)]
dipole: -0.4213762 -1.0066098 0.1529526 debye
dipolederiv: -0.580819 -0.0342014 -0.0676923 -0.0427188 -0.7764778 -0.0615532 -0.0746347 -0.0618809 -0.4243135 -0.6978506 0.0628719 0.0107682 0.0964774 -0.8328152 0.0808929 0.0017989 0.0862359 -0.3055044 -0.7316358 -0.0099385 -0.0094366 -0.0147423 -0.4807818 0.0269321 0.0170708 0.0059158 -0.5426552 -0.0187312 -0.1129304 -0.1155534 -0.1020182 0.2988007 0.0686541 -0.1484468 0.0879026 0.4074723 0.1408745 0.2342591 -0.0597302 0.2831397 0.278661 -0.06266 -0.0892815 -0.084498 0.331351 0.5276709 -0.0637209 0.07445 -0.0090738 0.0682299 -0.0392217 0.0643103 -0.0426673 0.3978162 0.4140183 0.2125871 0.046028 0.1148711 0.5081418 -0.0117632 0.0650005 -0.0883651 0.3475107 0.2761812 -0.1410524 -0.0077915 -0.0712923 0.54348 0.071866 0.0675593 0.138662 0.4090964 -0.5750263 0.0719426 -0.0151933 0.1561236 -0.0489887 0.0648626 -0.1448509 0.1012687 0.0946972 1.2923116 0.0409289 -0.0087863 -0.0220928 0.9637881 -0.1293327 0.0094396 -0.1348257 0.1059824 -0.3791131 -0.2556794 0.0322772 -0.2665068 -0.2570451 0.0144726 -0.0028476 -0.0258436 0.0386685 0.016199 0.0508351 0.0019487 0.0509566 -0.0038358 0.0779718 0.0400518 -0.0802995 -0.2671029 -0.0172836 -0.156065 0.0104968 -0.1220771 -0.0830818 0.0106537 0.0328969 0.0200143 0.0523769 0.0388293 0.1076392 0.0485174 0.027764 -0.1063808 -0.0780264 0.0400665 -0.0911299 0.0286933 -0.0240141 -0.0506288 -0.0213163 -0.0752956 -0.0046499 0.0206587 0.0693032 0.1650148 -0.2285801 -0.0725392 -0.0011584 0.0231757 -0.0108581 0.046935 0.0181554 -0.1245728 0.0672204 -0.2397048 0.0889608 0.0213883 -0.0085637 0.026159 -0.0707948 -0.0526044 0.0106476 -0.064119 0.0407046 0.013321 -0.0737382 0.011816 -0.0444647 0.0125883 0.0114975 -0.0148802 0.139227 -0.1938122 0.0007051 0.0636682 0.0294975 0.0576245 -0.1072351 -0.0713966 0.0538092 -0.1188307 0.0389707 -0.0669165 -0.110565 0.0078162 -0.1061394 -0.0823395 -0.0017071 0.0483663 0.0335055 0.0833691 0.0582258 0.0544191 0.0451314 0.0456286 -0.0008551 0.0667391 -0.0339403 -0.0449675 -0.2187793 0.0849227 -0.0011841 -0.0070453 -0.050295 -0.0895965 -0.0669457 0.0424559 -0.0976824 0.0453666 0.1169911 0.0237828 -0.0213376 -0.0280307 0.0804492 0.0375811 0.0452585 0.0502246 -0.0696958 0.1058717 -0.0140085 0.0266119 -0.0136296 0.0657835 -0.0701679 -0.0071638 -0.0878017 -0.045518 -0.0847456 0.0387227 0.0488429 0.086155 0.0548102 -0.0222511 0.0551612 0.0037213 0.1100881 0.0735918 0.0418259 -0.0749314 0.0343356 0.02321 0.0966921 -0.0225778 0.1239988 0.0035023 unknown
polarizability: 116.2401191|2.1984313|99.8903328|0.229901|-0.0499661|75.5724352 unknown
InChI: InChI=1S/C8H15NO2/c1-8(10)2-3-9-4-6-11-7-5-9/h2-7H2,1H3
charge 0 multiplicity 1
26 atoms
O  3.606003 -0.29677 -0.170404
O  -3.355937 1.317037 0.018829
N  0.753327 0.183286 0.177887
C  1.256983 -1.046772 -0.488298
C  1.711289 1.301662 -0.036785
C  -0.620667 0.553785 -0.240384
C  2.656695 -1.400592 0.042081
C  3.100872 0.916844 0.494657
C  -1.67534 -0.444525 0.266919
C  -3.107679 0.095285 0.201585
C  -4.223541 -0.929612 0.373856
H  1.307371 -0.914578 -1.599768
H  0.572746 -1.888934 -0.275829
H  1.343804 2.194521 0.503609
H  1.797314 1.565812 -1.121255
H  -0.707549 0.657533 -1.351893
H  -0.857567 1.545002 0.185963
H  2.591971 -1.634763 1.126954
H  3.080647 -2.262481 -0.499531
H  3.842644 1.7031 0.277677
H  3.045201 0.746252 1.591536
H  -1.640682 -1.412395 -0.270714
H  -1.453175 -0.680544 1.329846
H  -4.354917 -1.489527 -0.573216
H  -5.172911 -0.426505 0.614954
H  -3.975306 -1.669619 1.156125
