program: Gaussian 09
title: 000238498
version: EM64L-G09RevD.01
frameworkgroup: C1[X(C8H14O3)]
method: RPBEPBE
basis: SDD
operation: Freq
keyword: #pfreq=noraman
keyword: PBEPBE/SDD
title: #p freq=noraman PBEPBE/SDD
converged: YES YES NO NO
title: Mulliken charges:
elementType: O O O C C C C C C C C H H H H H H H H H H H H H H
charge: -0.253057 -0.192646 -0.251788 -0.473428 -0.351313 0.204834 -0.598915 -0.688173 0.279459 -0.267128 -0.659217 0.278954 0.221382 0.214300 0.219073 0.275357 0.240197 0.222109 0.205541 0.212488 0.226285 0.235870 0.217912 0.248135 0.233769
chargesum: 0.00000
title: Mulliken charges with hydrogens summed into heavy atoms:
elementType: O O O C C C C C C C C
charge: -0.253057 -0.192646 -0.251788 0.026908 0.082059 0.204834 -0.083361 -0.048035 0.279459 0.195026 0.040600
polarizability: 1.19343881e+02 1.88955011e-01 8.70568890e+01 -1.27695969e+00 3.94882603e+00 8.34254736e+01
1716.lowfreq: -0.0008 -0.0006 -0.0002 2.1813 7.0758 15.7316 22.2825 38.1730 58.8889
frequency: 18.4794 38.0866 58.8530 66.5479 74.9856 103.9308 157.2098 176.9872 212.4684 232.0002 271.6481 316.5001 344.1260 386.4811 435.4258 481.8304 544.4136 625.3407 683.7152 733.9187 775.0409 809.2570 824.3063 859.8002 897.2228 914.5628 940.1754 1011.4521 1051.6156 1066.5312 1089.3435 1096.5046 1117.9479 1138.1396 1156.6475 1199.6671 1225.6550 1271.1057 1277.8861 1285.1344 1301.8485 1355.7429 1362.0546 1392.3670 1393.6873 1430.8455 1438.7145 1456.8161 1463.8326 1471.8340 1479.5916 1484.0995 1484.8861 1620.0145 1641.3443 2951.4339 2973.1698 2994.6163 3000.4809 3000.8720 3016.3288 3031.8298 3045.6819 3073.5749 3075.7186 3090.0621 3095.9549 3122.0008 3124.1323
redmass: 4.2125 3.8154 2.3201 2.2280 3.9274 3.1981 3.4354 3.2130 1.3692 1.1053 2.6105 3.4030 3.4605 2.8582 2.4859 2.9914 5.1384 3.6178 2.7727 1.4693 2.2901 1.5572 2.3249 1.8174 2.1893 2.6303 1.7763 2.7004 2.1060 2.3496 1.6750 2.2005 2.3870 2.7796 1.6598 1.4979 1.3942 1.3806 1.1254 1.2524 1.4369 1.2910 1.7554 1.2290 1.2152 1.0912 1.0962 1.0971 1.0432 1.0581 1.0422 1.0522 1.0731 8.5642 8.4237 1.0632 1.0359 1.0362 1.0718 1.0826 1.0628 1.0597 1.1003 1.1001 1.1005 1.0974 1.1031 1.1063 1.0993
irintensity: 1.8302 3.2715 0.3248 0.7751 2.2391 2.0085 1.2831 3.4117 9.1288 0.3252 10.4478 6.7751 1.1095 0.8156 7.4974 1.7424 11.2533 9.2076 7.9139 8.7636 10.2598 3.9636 0.7180 8.6376 18.0457 6.1466 0.4700 54.0052 30.3766 45.1036 5.2264 48.4954 122.1197 253.9141 14.1260 23.0403 29.1991 120.6351 10.8373 33.4488 22.6972 3.7100 37.4104 23.0177 6.5928 26.6082 31.5016 15.8861 15.4792 4.4316 12.5692 13.1504 15.2519 227.4784 64.7366 11.3749 36.0144 16.0527 16.9920 2.9819 4.3240 31.3377 0.0270 58.9479 60.4225 32.7662 1.1297 30.2200 3.2282
temp: 298.150 k
press: 1.00000 atm
elementType: 8 8 8 6 6 6 6 6 6 6 6 1 1 1 1 1 1 1 1 1 1 1 1 1 1
symmnumber: 1
zpe: 546361.3 jmol-1
zpe.correction: 0.208098 hartree
zpe.thermalcorrener: 0.221546 hartree
zpe.thermalcorrenthalpy: 0.222490 hartree
zpe.thermalcorrgfe: 0.165658 hartree
zpe.sumelectzpe: -538.038742 hartree
zpe.sumelectthermal: -538.025294 hartree
zpe.sumelectthermalent: -538.024349 hartree
zpe.sumelectthermalfe: -538.081182 hartree
dipole: -1.3951 -0.6581 -1.5955
dipole: 2.2192
quadrupole: -55.2526 -71.2249 -68.9445
quadrupole: 0.7511 -4.2604 -7.7056
quadrupole: 9.8880 -6.0842 -3.8038 0.7511 -4.2604 -7.7056
hfenergy: -538.24684 hartree
pointgroup: C01 [X(C8H14O3)]
dipole: -0.4839667 0.2329756 -0.6883489 debye
dipolederiv: -1.6143798 -0.2118906 0.0841753 -0.2102759 -0.460916 -0.0890533 0.2071055 -0.0529933 -0.3946262 -0.5551061 0.1037939 -0.002694 0.241727 -0.331059 0.1171758 -0.1700959 0.0236656 -0.9072571 -0.7579515 -0.066103 0.0118312 0.050469 -0.4675055 -0.3279101 0.2091777 -0.1821762 -0.7323802 -0.2582273 0.1611687 0.1504742 0.1554392 0.0651087 -0.0262904 0.2124744 -0.0891886 -0.2742679 0.1040319 0.0309032 0.0095689 0.0126161 0.1210574 0.0140668 0.0603092 0.0112217 0.0816244 1.1031917 -0.3627305 0.0444194 -0.6971438 0.2486383 -0.2318705 0.1312021 -0.0804224 1.0413213 -0.8062702 0.0268076 -0.3654729 0.0683999 -0.1157836 -0.0356423 -0.324799 -0.0234567 -0.1657892 -0.005955 0.0555783 0.0520521 0.0750649 0.0639122 -0.019761 0.0206417 -0.0109208 0.0427403 1.9322854 0.2558338 -0.058915 0.2602254 0.4529074 0.5717482 -0.3953476 0.2927448 0.84166 0.7181498 0.1586598 0.0163141 0.2872863 0.4507382 0.0016433 0.2082195 0.0008787 0.2714257 -0.063772 -0.0106795 -0.0053813 -0.0608246 -0.140728 0.0444723 -0.0683036 0.0691249 0.0185733 0.1228073 -0.0182866 -0.0387099 0.0065764 0.0683191 -0.0563718 -0.0708635 -0.0067821 0.0433919 0.0389007 -0.0476447 0.0557821 -0.0247449 -0.0854578 0.0670753 0.0023682 0.0684837 0.0863325 -0.0155807 -0.0880087 0.0611604 -0.0641962 -0.0798701 0.0620134 0.0361717 0.0644011 0.0420264 0.0171099 -0.0125225 -0.0546616 -0.0226659 0.0271252 -0.0966497 -0.0898495 -0.0645338 -0.0753123 0.034713 0.0615312 0.0358236 0.0559938 0.0609574 -0.027044 0.0305108 -0.0602365 0.0247528 0.081827 -0.0710756 0.054414 -0.0602571 0.0534305 0.0396074 0.0532634 0.0723374 0.0303676 -0.0757423 0.1365707 -0.0350363 0.1582905 -0.0305012 0.0485827 -0.0638628 0.0714022 0.0487342 0.0132989 -0.0820987 0.0544381 -0.141572 -0.0927399 0.0791929 0.0699072 0.0438023 0.0463504 0.0317474 -0.0624409 -0.1054429 -0.0396014 0.0473743 -0.0848695 -0.045317 -0.1020574 -0.0930078 -0.1146934 0.0601894 0.000033 0.0662312 -0.0314765 -0.0083994 0.0265178 -0.0350742 0.097094 0.0511277 -0.0341096 0.0661531 -0.0740695 0.0374392 0.0095166 -0.0587277 0.0146916 -0.0995687 -0.0684399 -0.1134105 -0.0776724 -0.1464363 0.0253708 -0.029637 -0.0741971 -0.0359416 0.0726792 -0.0354077 0.1184998 0.0330079 0.0873071 0.0428446 0.0052254 0.0545035 -0.0099911 0.0790864 0.1223351 0.0114649 0.014339 0.0161605 0.0708143 -0.0268211 0.0389907 0.0210207 -0.1259512 unknown
polarizability: 119.2503816|-1.4840012|81.7225703|1.660245|2.4633098|88.8532914 unknown
InChI: InChI=1S/C8H14O3/c1-3-5-7(9)6-8(10)11-4-2/h3-6H2,1-2H3
charge 0 multiplicity 1
25 atoms
O  -2.374626 1.351825 0.12288
O  1.075021 0.986107 2.174056
O  -0.829004 0.499744 -1.405812
C  2.093077 0.733994 -0.042187
C  3.107074 -0.258052 0.557533
C  1.043497 1.231319 0.942088
C  -0.104846 2.088084 0.350591
C  4.182285 -0.677736 -0.466601
C  -1.100768 1.227718 -0.420287
C  -3.457921 0.528092 -0.510389
C  -3.497916 -0.871661 0.106968
H  1.560154 0.301166 -0.914293
H  2.618841 1.628637 -0.443747
H  2.565277 -1.149871 0.92564
H  3.580691 0.196506 1.447503
H  -0.621773 2.617502 1.163904
H  0.324692 2.816267 -0.363055
H  4.893855 -1.397559 -0.022984
H  4.763848 0.195707 -0.81845
H  3.727146 -1.156939 -1.353836
H  -4.372033 1.104191 -0.296793
H  -3.27492 0.486732 -1.598434
H  -4.35844 -1.432807 -0.30224
H  -2.578484 -1.432917 -0.12913
H  -3.611828 -0.815547 1.202979
