program: Gaussian 09
title: 000238520
version: EM64L-G09RevD.01
frameworkgroup: C1[X(C7H10Cl6N2O4)]
method: RPBEPBE
basis: SDD
operation: Freq
keyword: #p
keyword: freq=noraman
keyword: PBEPBE/SDD
title: #p freq=noraman PBEPBE/SDD
converged: YES YES NO NO
title: Mulliken charges:
elementType: Cl Cl Cl Cl Cl Cl O O O O N N C C C C C C C H H H H H H H H H H
charge: 0.039839 0.164795 0.143966 0.054179 0.147773 0.113148 -0.392468 -0.367223 -0.501848 -0.295681 -0.151921 -0.396763 -0.026603 -0.426001 0.348291 -0.618667 -0.027169 -0.277750 -0.616429 0.333291 0.269904 0.228510 0.323623 0.214209 0.246070 0.398713 0.349032 0.346639 0.376541
chargesum: 0.00000
title: Mulliken charges with hydrogens summed into heavy atoms:
elementType: Cl Cl Cl Cl Cl Cl O O O O N N C C C C C C C
charge: 0.039839 0.164795 0.143966 0.054179 0.147773 0.113148 -0.043436 -0.020584 -0.125307 -0.295681 -0.151921 0.001951 0.306688 0.072413 0.348291 -0.618667 0.296454 0.182529 -0.616429
polarizability: 1.99663548e+02 1.03505706e+01 1.62995096e+02 1.75490238e+01 -4.11315565e+00 1.40764739e+02
1716.lowfreq: -10.7444 -5.6354 0.0034 0.0035 0.0035 5.9007 17.7978 24.8843 35.1009
frequency: 17.4423 24.8166 34.9977 40.4301 53.4770 67.1633 83.3798 117.4913 124.2290 154.7848 161.5702 167.1082 180.2141 184.4942 206.3534 221.0837 245.6730 250.4350 255.4866 260.1717 265.9331 288.3026 295.1436 302.0886 322.5008 329.9114 344.4341 377.8847 384.9089 399.0690 454.7394 478.6457 496.8720 532.8491 544.3920 592.2690 651.7098 713.2887 731.1910 748.0473 762.3928 776.5904 809.9299 838.5568 889.2262 943.5474 947.3554 971.3277 993.2092 1006.8721 1014.5553 1040.5978 1072.6986 1157.3832 1178.1972 1207.0096 1231.9391 1245.3867 1253.7987 1269.8926 1320.5165 1326.6177 1344.7623 1379.2922 1385.3170 1386.0817 1406.8770 1463.3594 1475.3933 1557.9715 1628.4188 2982.7644 3016.4600 3046.2838 3061.2017 3073.3752 3089.2857 3144.4148 3482.5277 3520.2618 3617.6764
redmass: 11.8377 15.7213 10.4675 11.7765 5.1666 11.5402 7.7291 9.6924 7.1004 11.6464 7.1093 6.9419 9.0554 16.5511 8.5249 7.3045 5.8521 11.1384 3.6908 10.5712 13.9774 4.8192 4.6717 2.6901 1.3044 1.3532 2.5697 11.1620 7.4873 5.5592 3.1440 7.0380 5.3834 4.6608 4.9896 4.6212 5.4666 7.8983 8.1009 9.3426 8.1667 6.2447 3.7916 2.5257 1.6989 5.9521 3.2649 2.8807 5.0531 6.0339 3.7875 1.8488 3.1978 2.3592 2.4230 1.5377 1.3900 1.3629 1.3917 2.2776 1.2017 1.3329 1.2233 1.3440 1.3789 1.1501 1.2779 1.0987 1.1028 1.8930 3.0197 1.0585 1.0658 1.0848 1.1060 1.0857 1.0982 1.0864 1.0656 1.0654 1.0669
irintensity: 0.2371 0.0888 2.0404 0.3247 1.2828 0.5945 1.6333 1.4870 0.8118 1.7061 4.5216 7.5191 1.2464 0.8424 0.7752 1.9164 24.2004 8.0026 9.5961 5.1298 1.5263 38.9379 52.3335 51.9725 117.8807 89.9176 22.2015 13.2001 1.3761 77.3810 2.9685 8.6245 108.0046 34.5969 139.6454 42.8019 12.7005 24.3677 128.6344 112.6985 121.2383 72.2698 32.3545 84.0906 117.7567 30.0987 82.2145 69.2894 213.1150 84.2058 89.9938 59.6177 77.4753 1.1171 140.6021 21.2679 50.8567 68.5083 81.5989 236.4404 11.9476 126.6297 43.7021 26.6088 28.3180 22.9426 27.2530 34.6586 32.4490 350.3494 227.6927 63.6146 8.1446 31.4686 30.0807 28.8442 4.4639 445.9165 31.1216 16.7308 23.2991
temp: 298.150 k
press: 1.00000 atm
elementType: 17 17 17 17 17 17 8 8 8 8 7 7 6 6 6 6 6 6 6 1 1 1 1 1 1 1 1 1 1
symmnumber: 1
zpe: 481044.2 jmol-1
zpe.correction: 0.183220 hartree
zpe.thermalcorrener: 0.205851 hartree
zpe.thermalcorrenthalpy: 0.206795 hartree
zpe.thermalcorrgfe: 0.128349 hartree
zpe.sumelectzpe: -3441.973852 hartree
zpe.sumelectthermal: -3441.951221 hartree
zpe.sumelectthermalent: -3441.950277 hartree
zpe.sumelectthermalfe: -3442.028723 hartree
dipole: 1.0445 6.6373 -0.6919
dipole: 6.7546
quadrupole: -160.0250 -144.6809 -155.6314
quadrupole: 0.7091 -0.5164 -0.5787
quadrupole: -6.5792 8.7649 -2.1857 0.7091 -0.5164 -0.5787
hfenergy: -3442.1570719 hartree
pointgroup: C01 [X(C7H10Cl6N2O4)]
dipole: 0.4347146 2.4462226 -0.9428964 debye
polarizability: 201.419058|13.0368722|158.8534889|11.7995479|-9.9266863|143.1508363 unknown
InChI: InChI=1S/C7H10Cl6N2O4/c8-6(9,10)3(17)14-5(19)15(1-2-16)4(18)7(11,12)13/h3-4,14,16-18H,1-2H2
charge 0 multiplicity 1
29 atoms
Cl 4.50674 0.516829 -1.08416
Cl 2.931247 -2.082361 -0.943054
Cl 4.722704 -1.273344 1.351285
Cl -4.140793 1.035899 -0.658496
Cl -4.922353 -1.519891 0.776381
Cl -3.061871 0.433219 2.129157
O  2.822508 1.333899 1.350356
O  -2.71014 -1.68553 -1.392585
O  -1.000927 2.51566 -0.771366
O  0.180457 -1.563531 1.034442
N  1.147684 0.283026 -0.037849
N  -1.176901 -0.165917 -0.271078
C  2.344235 0.090591 0.776142
C  1.110801 1.356161 -1.054282
C  0.043936 -0.54869 0.286242
C  3.525816 -0.670686 0.064779
C  -2.308186 -1.056914 -0.14547
C  0.461879 2.677799 -0.607011
C  -3.533916 -0.336473 0.504219
H  2.040632 -0.568803 1.609329
H  0.583275 0.990356 -1.95503
H  2.147177 1.567062 -1.363658
H  -2.018802 -1.894932 0.511815
H  0.809436 3.498773 -1.264738
H  0.730448 2.896157 0.443298
H  -1.305853 0.820924 -0.587711
H  3.555726 1.709722 0.791674
H  -2.941081 -0.982368 -2.05647
H  -1.506778 3.19926 -0.270659
