program: Gaussian 09
title: 000238496
version: EM64L-G09RevD.01
frameworkgroup: C1[X(C8H14O2)]
method: RPBEPBE
basis: SDD
operation: Freq
keyword: #pfreq=noraman
keyword: PBEPBE/SDD
title: #p freq=noraman PBEPBE/SDD
converged: YES YES NO NO
title: Mulliken charges:
elementType: O O C C C C C C C C H H H H H H H H H H H H H H
charge: -0.197252 -0.202274 -0.160800 0.213350 -0.607880 -0.691751 -0.688608 0.224013 -0.473212 -0.672210 0.251800 0.243588 0.246422 0.224875 0.231191 0.210154 0.230986 0.228488 0.216633 0.233641 0.265763 0.226948 0.214502 0.231633
chargesum: 0.00000
title: Mulliken charges with hydrogens summed into heavy atoms:
elementType: O O C C C C C C C C
charge: -0.197252 -0.202274 0.091000 0.213350 -0.117870 -0.025531 -0.012502 0.224013 0.026192 0.000873
polarizability: 1.09601812e+02 -6.06127659e-02 8.58243647e+01 -2.16322767e-01 -4.15992560e+00 8.17143470e+01
1716.lowfreq: -15.4351 -6.2306 -0.0014 -0.0012 -0.0009 9.7787 33.9044 39.9420 50.9309
frequency: 33.8930 39.8934 50.8940 76.9032 125.2275 177.6107 181.4850 203.3702 218.6950 239.7426 283.1443 318.8873 377.5314 439.1068 485.7759 539.3658 594.8085 702.8022 718.1038 764.6441 820.2910 887.0158 923.7672 930.7029 964.2129 995.1613 1010.3530 1059.5070 1077.0349 1093.9671 1109.5227 1117.4859 1169.3740 1208.5816 1218.5158 1251.8416 1284.1507 1338.9573 1344.7110 1378.2167 1396.6191 1397.2950 1431.6574 1446.0415 1463.9488 1466.6638 1469.9994 1478.7685 1479.9629 1486.6678 1609.6149 1636.2750 2963.0179 2978.4360 2982.2124 2991.7213 2998.6210 3005.3699 3034.1314 3079.8615 3086.4029 3089.1134 3095.6016 3095.9384 3099.8387 3115.0820
redmass: 4.3507 3.6339 3.1925 2.0838 3.0139 1.0744 1.2763 3.4883 1.1981 2.7784 2.4932 3.3686 2.7899 2.1356 2.9680 4.0403 3.2441 3.0050 2.6724 2.1699 2.0018 2.5821 1.2028 2.0563 1.3962 2.5887 1.5109 1.5454 2.2745 1.8485 2.4180 2.3875 1.7894 1.3261 1.4683 1.2135 1.3482 1.7052 1.7791 1.2030 1.2054 1.2095 1.0968 1.0924 1.0458 1.0475 1.0394 1.0503 1.0491 1.0597 8.2537 8.1558 1.0615 1.0830 1.0343 1.0360 1.0361 1.0969 1.0564 1.1001 1.1009 1.1000 1.1004 1.0997 1.0999 1.1071
irintensity: 7.1104 1.6448 2.2486 2.1197 1.5991 0.2215 0.2696 0.8072 0.2800 8.0124 3.5802 2.0926 2.4023 4.8991 0.9031 2.9738 9.7764 3.4826 2.6615 5.4277 2.9457 2.1535 7.4255 49.9602 1.4942 6.9707 24.7925 18.7288 140.9108 12.1470 160.8253 4.6067 13.0966 32.0041 15.8995 13.8662 15.5741 47.3678 7.5324 15.4438 26.9144 14.3954 35.7190 16.3591 9.2348 1.0278 13.2865 11.7354 16.1299 20.0244 219.2656 16.4922 14.4661 4.9824 29.7336 22.9626 24.5800 2.7495 6.1800 32.6973 8.0657 39.9780 23.4131 35.1366 25.1971 8.5578
temp: 298.150 k
press: 1.00000 atm
elementType: 8 8 6 6 6 6 6 6 6 6 1 1 1 1 1 1 1 1 1 1 1 1 1 1
symmnumber: 1
zpe: 533140.4 jmol-1
zpe.correction: 0.203062 hartree
zpe.thermalcorrener: 0.215682 hartree
zpe.thermalcorrenthalpy: 0.216626 hartree
zpe.thermalcorrgfe: 0.162960 hartree
zpe.sumelectzpe: -462.889581 hartree
zpe.sumelectthermal: -462.876962 hartree
zpe.sumelectthermalent: -462.876018 hartree
zpe.sumelectthermalfe: -462.929684 hartree
dipole: 0.3796 -0.9186 -1.1581
dipole: 1.5261
quadrupole: -55.7306 -67.5981 -62.9208
quadrupole: -5.5539 5.1121 6.2568
quadrupole: 6.3526 -5.5149 -0.8376 -5.5539 5.1121 6.2568
hfenergy: -463.0926437 hartree
pointgroup: C01 [X(C8H14O2)]
dipole: -0.122824 -0.5822317 -0.0801855 debye
dipolederiv: -0.5257931 0.0832558 -0.0662551 0.2335602 -0.3442926 -0.1110729 0.1338277 -0.0686094 -0.9133315 -0.5568148 -0.0734831 -0.0585915 -0.2677586 -0.4046291 0.2744956 0.1455316 0.172125 -0.8331208 -0.23197 0.056735 -0.1742857 0.0433707 0.068861 -0.0429418 -0.1500403 0.0175685 -0.0771441 1.0587008 -0.3297154 -0.0048136 -0.8159526 0.2049486 0.2744195 -0.1962624 0.1300352 1.01828 -1.0102146 -0.0451702 0.4763241 -0.0324575 -0.1164225 -0.0126236 0.4229625 -0.0180917 -0.2075194 0.00887 0.0205511 0.0324865 0.0248838 -0.0294404 -0.0550107 -0.0346556 -0.0368961 0.0563319 0.0586936 -0.0125549 -0.0113701 0.1026671 -0.0009559 0.0325753 -0.055644 -0.0242947 0.0825713 1.1516656 0.3076279 0.0439228 0.7553503 0.3274833 -0.4758461 -0.0604008 -0.2652497 0.8752192 -0.2117696 -0.0597026 -0.1713537 -0.0425214 0.0919997 0.0820187 -0.2447976 0.0215718 -0.1822903 0.0023459 -0.0575819 0.0284466 -0.0526133 0.0070736 0.0169269 -0.0142203 0.02065 0.0760982 0.0362625 -0.0215254 0.0805455 0.0200686 0.0366508 0.0142668 0.076264 0.0010824 -0.0367755 0.065411 0.0735914 -0.0511774 0.0621609 0.0113542 0.0423176 -0.0568228 0.0744099 0.0303772 0.076016 -0.0680918 -0.0766034 -0.0466226 0.0445008 -0.0281797 -0.0810666 -0.0564509 -0.0019772 -0.0135787 -0.1390211 -0.0112859 -0.0950839 -0.0597535 -0.0285939 -0.0009539 -0.0361673 0.081843 0.0811365 -0.0062552 0.0557986 -0.0375138 0.0652783 0.0760288 0.1030162 0.0125077 -0.0709321 -0.0810475 0.0969866 -0.0904323 0.0834711 0.0499616 0.0176261 -0.1167819 0.0532555 0.0110051 -0.098764 0.0283406 -0.1087985 0.0489614 0.0583348 0.0563615 -0.1116686 0.0431047 0.0203983 0.0343332 -0.0434106 0.037705 -0.039588 0.0719469 0.0197552 0.1132966 0.0691379 -0.0858971 0.0650813 0.0917136 0.0654022 0.0600431 -0.1073757 -0.0905208 0.0491915 -0.0984726 0.041531 0.0346834 0.0323164 -0.0345023 0.0188973 -0.1162824 0.0166603 0.0104761 0.0039896 0.1155037 0.0453538 -0.0052683 0.0871039 -0.0544207 0.0867011 -0.0331894 0.0721244 0.0061189 -0.000165 0.0355294 0.1141427 0.0034881 0.0584499 -0.0972346 0.0046613 0.0185672 0.0208716 0.092056 -0.0921986 -0.0462528 -0.1094998 -0.0394352 0.0828145 0.0050386 -0.1494325 -0.0182425 -0.0113971 0.068068 0.0027724 0.057746 0.0120829 0.0684776 -0.0551732 0.1274894 -0.0239539 -0.0806647 unknown
polarizability: 109.329632|1.9364956|79.2717668|-1.7442598|-0.5390692|88.5391251 unknown
InChI: InChI=1S/C8H14O2/c1-4-7(9)5-8(10)6(2)3/h6H,4-5H2,1-3H3
charge 0 multiplicity 1
24 atoms
O  -0.655742 -0.562938 1.809729
O  1.265534 -0.129621 -1.797994
C  -1.948224 -0.190717 -0.251879
C  -0.80179 -0.778518 0.577613
C  0.226206 -1.640287 -0.189333
C  -2.563522 1.053436 0.418832
C  -3.020611 -1.298793 -0.481068
C  1.352835 -0.703773 -0.68123
C  2.511577 -0.494607 0.286259
C  3.492859 0.609284 -0.140169
H  -1.523705 0.079082 -1.24124
H  0.631869 -2.399061 0.500287
H  -0.240337 -2.113572 -1.068347
H  -1.815864 1.857427 0.537055
H  -2.945728 0.804164 1.423883
H  -3.398487 1.441976 -0.191465
H  -3.824367 -0.905779 -1.128482
H  -3.471171 -1.604458 0.480459
H  -2.600644 -2.196701 -0.969966
H  3.034065 -1.469454 0.390943
H  2.076342 -0.296763 1.288335
H  2.983784 1.586616 -0.20244
H  4.321469 0.693636 0.584788
H  3.916149 0.397823 -1.136869
