program: Gaussian 09
title: 000238494
version: EM64L-G09RevD.01
frameworkgroup: C1[X(C7H15NO)]
method: RPBEPBE
basis: SDD
operation: Freq
keyword: #p
keyword: freq=noraman
keyword: PBEPBE/SDD
title: #p freq=noraman PBEPBE/SDD
converged: YES YES NO NO
title: Mulliken charges:
elementType: O N C C C C C C C H H H H H H H H H H H H H H H
charge: -0.216986 -0.284867 -0.327617 -0.356712 -0.376948 -0.494825 -0.679895 0.226286 -0.764953 0.174237 0.206367 0.204644 0.224480 0.232651 0.219292 0.183800 0.219234 0.249203 0.208454 0.210158 0.218427 0.228436 0.254894 0.242240
chargesum: 0.00000
title: Mulliken charges with hydrogens summed into heavy atoms:
elementType: O N C C C C C C C
charge: -0.216986 -0.052216 0.052986 0.072413 0.026144 -0.026388 -0.042856 0.226286 -0.039382
polarizability: 1.10716960e+02 1.63517810e+00 8.26936702e+01 -8.21325049e-01 3.60906007e-01 6.74549528e+01
1716.lowfreq: -6.1511 -0.0007 0.0007 0.0009 5.2630 10.6149 34.7055 49.2607 72.2922
frequency: 34.4533 47.8927 72.2037 78.7166 89.0812 123.2167 145.8685 183.3515 217.9578 248.0358 329.2010 437.3840 458.4328 463.7937 576.8308 689.2975 752.3247 757.7150 831.0557 885.0168 897.3044 919.8672 948.7989 1012.6140 1059.3413 1065.1457 1079.4905 1127.8942 1135.4971 1141.4335 1170.9074 1199.9964 1237.9319 1269.1805 1281.1079 1287.0040 1312.7554 1355.0528 1366.7989 1387.3411 1395.8162 1431.6411 1443.7107 1453.2806 1455.8361 1472.0133 1477.3764 1481.3048 1487.3636 1495.9848 1632.9836 2850.0384 2898.4972 2955.7931 2967.3541 2975.3223 2981.0728 2996.6853 3008.9647 3033.8128 3035.7031 3068.5583 3071.8274 3076.5476 3119.0722 3408.9119
redmass: 2.6426 2.4438 3.1868 1.1009 2.1113 2.0226 2.2604 3.7479 1.1590 4.0900 2.9731 3.5057 2.9744 2.1479 3.9759 1.3182 1.1965 1.1223 3.2813 1.1792 1.7357 1.3552 1.7395 2.9459 1.8733 2.6128 2.2178 1.9955 1.6334 3.0506 2.1194 1.6842 1.3362 1.1548 1.1307 1.2938 1.5625 1.5651 1.2402 1.2712 1.4333 1.0973 1.0702 1.2065 1.0586 1.0613 1.0431 1.0698 1.0872 1.0834 7.7182 1.0713 1.0713 1.0637 1.0651 1.0365 1.0382 1.0842 1.0898 1.0925 1.0981 1.0948 1.1007 1.0991 1.1007 1.0737
irintensity: 1.9871 2.1661 1.6331 0.6835 0.3206 3.7777 3.2587 5.7391 0.2353 0.4533 0.1441 4.4933 3.2877 2.5216 12.5310 89.1222 0.1983 10.7554 1.4786 4.0210 1.8178 3.6655 11.3312 2.7134 21.4901 7.4632 2.8701 2.5274 5.0674 83.6046 15.3672 2.7633 15.2325 7.4781 4.5788 11.5087 36.5405 48.8313 61.9748 16.9240 10.7801 21.1028 23.5232 20.0684 18.6315 5.0582 13.0460 4.4392 2.1072 10.3711 106.1211 104.1592 79.8695 18.5638 31.6087 33.2274 5.2743 38.1862 9.0103 33.8944 16.5915 16.5096 81.8845 49.4204 14.3984 3.4926
temp: 298.150 k
press: 1.00000 atm
elementType: 8 7 6 6 6 6 6 6 6 1 1 1 1 1 1 1 1 1 1 1 1 1 1 1
symmnumber: 1
zpe: 552392.2 jmol-1
zpe.correction: 0.210395 hartree
zpe.thermalcorrener: 0.222497 hartree
zpe.thermalcorrenthalpy: 0.223441 hartree
zpe.thermalcorrgfe: 0.170713 hartree
zpe.sumelectzpe: -404.950961 hartree
zpe.sumelectthermal: -404.938860 hartree
zpe.sumelectthermalent: -404.937916 hartree
zpe.sumelectthermalfe: -404.990644 hartree
dipole: 0.4974 -2.5941 -0.7246
dipole: 2.7390
quadrupole: -55.0406 -61.2881 -55.1728
quadrupole: 10.0092 -1.5085 1.8780
quadrupole: 2.1266 -4.1209 1.9944 10.0092 -1.5085 1.8780
hfenergy: -405.1613565 hartree
pointgroup: C01 [X(C7H15N1O1)]
dipole: 0.2107757 1.014743 0.2950706 debye
dipolederiv: -0.6704584 -0.0291684 -0.025535 -0.061266 -0.8680897 0.0272696 -0.034106 0.0168362 -0.2930142 -0.8778964 0.0348574 0.0107837 0.0231147 -0.4587686 0.1850379 0.0158859 0.2250241 -0.2395615 0.4561474 -0.1787305 0.0136516 -0.2662201 0.3097321 -0.090665 -0.1027586 -0.0834595 0.3235145 0.4702475 0.1422184 -0.0249305 0.1946937 0.2482946 -0.0997046 0.100798 -0.0790838 0.3025025 -0.0231172 0.016478 0.0158478 0.033122 0.0850217 0.0131773 -0.0031207 0.0332216 0.173563 -0.4834047 -0.1305238 -0.0540664 -0.2616495 -0.11889 -0.0074944 -0.0430228 0.0096683 0.152224 -0.0676411 0.0384545 0.009843 -0.0013817 0.0528049 -0.0081582 0.0037521 -0.010195 0.0968099 1.2356402 -0.0163072 0.1267538 0.0365944 0.9921444 -0.05214 0.1587477 -0.0559434 0.0916464 -0.4323881 0.2388997 -0.072338 0.2240823 -0.1703511 0.0638793 -0.1337937 0.1058058 0.0062294 -0.0848936 0.0304569 -0.00581 0.128363 -0.1517583 0.1400912 -0.0675519 0.1884003 -0.1129331 0.0307463 -0.0108074 -0.0270723 0.0298565 -0.0254007 -0.0964307 -0.0003021 -0.1187501 -0.1107193 -0.058535 -0.0155397 0.0011836 -0.084144 -0.0899509 0.1296069 0.0647965 0.1535203 -0.102599 0.0524068 0.0028952 0.0242089 -0.0153711 -0.0064956 -0.0844536 -0.008467 -0.0957314 -0.0812228 0.1110002 -0.0019763 -0.0025733 0.0141901 0.1803399 -0.0944739 -0.0062228 -0.1988013 0.0189886 0.0498158 0.0294513 -0.0230657 0.0014135 -0.0505879 0.1154507 0.0014639 0.1344319 -0.0526237 0.0276118 0.0236016 0.0269321 -0.0059281 -0.0262155 -0.1207708 0.0126822 -0.1564729 -0.1228589 0.0592314 -0.0067323 0.0147234 0.0517597 0.0221227 -0.0919172 0.0165311 -0.1252992 -0.0533384 0.0942404 -0.00868 -0.0189362 0.0788789 0.0088087 0.095252 -0.0269198 0.1122105 -0.008064 0.0784842 0.0084826 0.0114045 0.061763 -0.032407 0.1246273 -0.0336875 0.1407429 -0.0722486 0.0801816 -0.0002789 -0.0265238 0.0462992 0.0011605 -0.1202211 0.0239248 -0.1312642 -0.1027107 -0.1598509 -0.1030174 0.0071431 -0.1392842 0.0001655 0.0009389 0.00393 -0.0017979 0.1017493 0.0874025 -0.0362439 -0.0482674 -0.0151974 -0.0450615 -0.1015926 0.0052816 -0.127087 0.0455138 -0.0747705 -0.0430411 0.0392995 -0.089627 0.0448185 0.0329497 0.0591578 0.0106477 0.1122098 0.0997997 0.0152512 0.0273435 0.0159381 0.0985634 0.0397414 -0.0069989 0.0533761 -0.073057 unknown
polarizability: 110.6594699|-2.0659112|82.7413207|0.8517329|0.4933353|67.4647927 unknown
InChI: InChI=1S/C7H15NO/c1-3-5-8-6-4-7(2)9/h8H,3-6H2,1-2H3
charge 0 multiplicity 1
24 atoms
O  -2.945103 -1.357135 0.044311
N  0.979119 0.434602 0.121513
C  2.211176 -0.379969 0.015629
C  -0.278754 -0.345497 0.110668
C  3.46853 0.511538 0.016876
C  -1.487366 0.603822 0.119316
C  4.773132 -0.305994 -0.094717
C  -2.840082 -0.101249 0.020948
C  -4.064174 0.797156 -0.137393
H  2.299476 -1.141726 0.832873
H  2.163539 -0.945564 -0.936595
H  -0.36611 -1.067292 0.957569
H  -0.302576 -0.95382 -0.812889
H  1.024429 1.060084 0.940422
H  3.390067 1.229942 -0.82095
H  3.488666 1.113597 0.949744
H  -1.493371 1.22031 1.045208
H  -1.394782 1.331467 -0.712805
H  4.878695 -1.009602 0.752625
H  4.790597 -0.899543 -1.028137
H  5.659664 0.353649 -0.098544
H  -3.975442 1.720268 0.462797
H  -4.978402 0.249423 0.14074
H  -4.154424 1.104135 -1.19811
