program: Gaussian 09
title: 000238488
version: EM64L-G09RevD.01
frameworkgroup: C1[X(C10H14O4)]
method: RPBEPBE
basis: SDD
operation: Freq
keyword: #pfreq=noraman
keyword: PBEPBE/SDD
title: #p freq=noraman PBEPBE/SDD
converged: NO YES NO NO
title: Mulliken charges:
elementType: O O O O C C C C C C C C C C H H H H H H H H H H H H H H
charge: -0.411958 -0.411965 -0.235284 -0.235302 -0.127259 -0.127241 -0.220115 -0.219936 -0.471990 -0.475363 -0.475400 -0.472055 0.116237 0.116209 0.245721 0.245728 0.311560 0.311584 0.230781 0.211799 0.208455 0.239284 0.208479 0.239317 0.230779 0.211815 0.378067 0.378054
chargesum: 0.00000
title: Mulliken charges with hydrogens summed into heavy atoms:
elementType: O O O O C C C C C C C C C C
charge: -0.033891 -0.033911 -0.235284 -0.235302 0.118461 0.118487 0.091445 0.091648 -0.029410 -0.027624 -0.027604 -0.029461 0.116237 0.116209
polarizability: 1.15608142e+02 5.31176843e-03 1.08946144e+02 -2.73496783e+00 -9.20515196e-03 1.05527473e+02
1716.lowfreq: -0.0011 -0.0009 -0.0005 5.7086 15.4964 20.6187 22.5962 37.1752 44.8807
frequency: 20.6143 37.1732 44.6688 119.3727 130.3926 181.9211 188.2941 254.6116 293.1334 323.9020 339.4555 390.3257 425.2387 511.0403 549.1466 558.1483 567.6013 607.3958 614.5709 641.3185 690.5445 696.4935 781.7149 805.3466 832.2404 834.9342 843.3570 881.7941 902.3259 930.6290 963.2431 966.8082 996.8771 1036.8944 1058.6404 1063.6836 1066.4503 1089.2179 1091.7256 1111.3499 1157.0737 1174.3867 1185.4112 1223.7827 1231.6419 1241.9657 1251.0856 1261.0829 1267.2249 1294.0549 1316.1700 1317.1888 1324.5022 1329.7196 1333.4944 1348.7829 1362.8664 1390.0249 1464.5910 1471.2854 1480.4741 1492.6159 1649.6400 1650.6061 2984.2839 2984.9496 2999.1671 2999.3171 3007.8866 3014.4867 3032.0921 3035.3118 3036.1159 3042.8663 3056.8538 3062.9348 3512.0757 3512.2888
redmass: 3.3974 12.1027 10.8101 4.7842 5.0190 2.2374 4.4062 2.0571 4.7280 3.4133 6.9526 2.6518 3.3957 4.3113 3.6753 2.8590 1.8720 4.3929 1.6608 2.3409 3.6706 4.1410 1.4129 2.3684 1.9252 3.6967 2.8712 2.6252 2.3733 2.6122 2.4954 4.5500 2.7739 2.8156 2.2558 2.0618 1.9228 1.9551 1.8279 1.5837 1.0680 1.6379 1.1329 1.2924 1.1280 1.4127 1.2502 1.6787 1.6219 1.7156 1.4946 1.5760 1.4359 1.5833 1.5080 1.4586 1.4332 1.7901 1.0757 1.0806 1.0853 1.0916 8.4474 8.2364 1.0595 1.0588 1.0634 1.0622 1.0827 1.0824 1.1027 1.1018 1.0865 1.0877 1.1039 1.1035 1.0640 1.0640
irintensity: 0.1685 1.1849 0.7537 0.1084 2.3945 0.6571 1.2975 0.4919 1.5716 4.4480 0.3704 0.0497 9.4862 2.8124 86.4606 1.5284 106.0656 4.2745 70.6109 75.8225 16.4002 46.8719 0.0559 4.3971 3.8085 3.8707 22.6335 9.5935 1.0353 2.0890 0.0370 96.0982 16.1925 73.2420 0.7523 328.3431 6.2560 17.8677 17.7940 31.0302 1.9095 7.3858 6.6868 3.4664 0.1653 13.4586 1.3358 25.2865 31.0820 0.1659 0.6167 29.9324 0.6887 42.2465 5.2220 7.0159 0.9949 18.3107 0.0161 8.2033 21.3930 4.4746 325.3403 57.2553 48.8141 2.0552 33.5109 70.1996 1.6555 6.4087 0.4728 6.6912 71.1183 7.4122 26.1422 86.8646 37.9395 13.0368
temp: 298.150 k
press: 1.00000 atm
elementType: 8 8 8 8 6 6 6 6 6 6 6 6 6 6 1 1 1 1 1 1 1 1 1 1 1 1 1 1
symmnumber: 1
zpe: 603772.6 jmol-1
zpe.correction: 0.229965 hartree
zpe.thermalcorrener: 0.242769 hartree
zpe.thermalcorrenthalpy: 0.243713 hartree
zpe.thermalcorrgfe: 0.188978 hartree
zpe.sumelectzpe: -689.305421 hartree
zpe.sumelectthermal: -689.292617 hartree
zpe.sumelectthermalent: -689.291673 hartree
zpe.sumelectthermalfe: -689.346407 hartree
dipole: 0.0007 1.8740 0.0007
dipole: 1.8740
quadrupole: -72.2680 -79.9640 -91.2593
quadrupole: -0.0006 -3.5128 0.0047
quadrupole: 8.8958 1.1998 -10.0955 -0.0006 -3.5128 0.0047
hfenergy: -689.5353855 hartree
pointgroup: C01 [X(C10H14O4)]
dipole: -0.0052643 0.7372514 -0.0000644 debye
polarizability: 115.0472559|0.0374146|108.9463665|-3.5801459|-0.0138159|106.0881354 unknown
InChI: InChI=1S/C10H14O4/c11-9(12)7-5-1-2-6(4-3-5)8(7)10(13)14/h5-8,11,13H,1-4H2
charge 0 multiplicity 1
28 atoms
O  -2.646165 -1.521729 1.058317
O  2.664316 -1.487586 -1.058717
O  -1.910889 -1.729376 -1.129034
O  1.933628 -1.70294 1.129448
C  -1.077509 1.072296 0.753007
C  1.062786 1.086226 -0.752586
C  -0.589563 -0.398956 0.505663
C  0.593766 -0.391219 -0.505228
C  0.066411 1.83764 1.467958
C  -1.393345 1.758686 -0.601297
C  1.369614 1.776895 0.601548
C  -0.090953 1.836329 -1.467833
C  -1.731503 -1.274133 0.024198
C  1.7473 -1.251138 -0.024039
H  -1.976675 1.045697 1.39487
H  1.962221 1.071189 -1.394452
H  -0.252256 -0.808649 1.477096
H  0.261851 -0.805016 -1.476763
H  0.24197 1.400382 2.468308
H  -0.25092 2.885894 1.625227
H  -1.793856 2.770676 -0.405213
H  -2.185685 1.20244 -1.136031
H  1.757027 2.793955 0.405474
H  2.16899 1.230925 1.136385
H  -0.260676 1.396484 -2.468047
H  0.212481 2.888662 -1.625266
H  -3.388789 -2.085051 0.708138
H  3.414625 -2.040683 -0.708637
