program: Gaussian 09
title: 000238491
version: EM64L-G09RevD.01
frameworkgroup: C1[X(C14H17N3)]
method: RPBEPBE
basis: SDD
operation: Freq
keyword: #pfreq=noraman
keyword: PBEPBE/SDD
title: #p freq=noraman PBEPBE/SDD
converged: YES YES NO NO
title: Mulliken charges:
elementType: N N N C C C C C C C C C C C C C C H H H H H H H H H H H H H H H H H
charge: -0.158677 -0.055825 -0.015444 -0.401338 -0.388197 -0.386699 -0.389039 -0.399597 0.123551 0.054184 0.081071 0.040192 -0.793603 -0.347050 -0.331232 -0.219085 -0.231787 0.192439 0.219398 0.205584 0.200094 0.199217 0.204779 0.252271 0.205001 0.211431 0.237023 0.230206 0.236753 0.258044 0.253017 0.255336 0.228223 0.229760
chargesum: 0.00000
title: Mulliken charges with hydrogens summed into heavy atoms:
elementType: N N N C C C C C C C C C C C C C C
charge: -0.158677 -0.055825 -0.015444 0.010499 0.017480 0.017298 0.068233 0.048857 0.123551 0.054184 0.081071 0.040192 -0.068600 -0.094033 -0.075897 0.009138 -0.002027
polarizability: 2.90626143e+02 1.68812193e+01 1.70545506e+02 3.49776549e-01 -2.43836345e+00 9.50446227e+01
1716.lowfreq: -12.9071 -7.8287 -0.0004 0.0004 0.0004 7.1965 42.1149 58.2443 68.4231
frequency: 41.9621 58.2185 68.4151 124.3484 146.3849 217.4952 224.3879 238.3931 260.9406 278.4854 304.1865 320.4762 349.2508 394.2105 434.5529 452.1091 462.3676 468.1093 490.1418 548.9309 555.1405 564.5923 599.5573 653.3059 688.5200 715.4452 771.3566 782.8150 791.5647 801.8367 831.8673 847.9964 873.7224 877.7280 903.1318 932.6190 948.5315 962.0270 989.6649 1005.0870 1014.0281 1014.6392 1035.3286 1051.8140 1083.5045 1110.6536 1123.4880 1127.5036 1150.1740 1156.0463 1175.3927 1209.6884 1233.5534 1247.8478 1258.5415 1264.7450 1280.4241 1316.8934 1322.0740 1331.2723 1339.5211 1347.2130 1350.3790 1364.4882 1383.9729 1390.4135 1433.4704 1446.3781 1452.5980 1459.6838 1460.4575 1462.7922 1468.1056 1471.9082 1476.3161 1492.8371 1527.4015 1550.0252 1613.8129 2906.1193 2929.7630 2970.0258 2978.0698 2984.6311 2985.8142 3036.9237 3044.7225 3054.0880 3064.6456 3092.2459 3106.7322 3111.8717 3130.0530 3144.3167 3159.0658 3169.7652
redmass: 3.7589 3.4508 3.5348 3.8033 3.6608 1.8075 1.3253 2.5000 3.2603 3.8996 2.8803 3.0404 4.1379 1.9632 2.9368 4.9453 3.6709 2.4799 4.1778 2.9308 4.2188 3.8654 8.7009 3.7970 5.6493 4.6583 1.3266 4.4618 3.6832 1.5143 2.7162 1.5249 4.1428 1.6270 2.6141 2.8445 1.4316 1.3626 1.3143 2.0264 2.1853 2.1363 1.5431 1.9282 1.4506 1.6942 2.7993 2.1652 1.2380 1.1613 2.9132 2.0294 2.4240 1.8789 1.4123 1.2174 1.6918 2.3710 2.9319 1.4370 1.4724 1.5850 1.5487 1.4161 1.6426 2.4019 3.9344 1.3181 1.0944 2.4764 1.1941 1.8851 1.1130 1.2002 1.1323 1.0902 6.2786 6.6898 6.6251 1.0736 1.0714 1.0631 1.0399 1.0609 1.0614 1.0963 1.1025 1.1034 1.0932 1.0904 1.0955 1.0916 1.0854 1.0892 1.0954 1.1005
irintensity: 0.8089 0.9605 0.4392 4.4317 1.0393 1.6094 1.6777 1.7827 2.5419 3.5825 1.3483 0.9490 1.8860 10.2299 1.0784 2.6296 2.4968 4.5128 0.9005 2.8986 2.9431 0.9884 13.5691 5.0408 0.1370 6.3551 96.4526 5.6826 1.0391 0.4013 0.2291 24.1845 5.3417 0.3064 7.6586 20.7696 2.0988 3.0415 0.0206 15.4027 12.5382 9.9258 10.1874 3.7619 5.5630 4.3744 8.7503 50.9661 4.0584 7.0431 29.4020 24.3010 6.1271 124.9711 0.8047 9.2576 45.8346 18.3313 3.1856 6.4645 2.5375 17.3049 5.6114 38.8705 49.2261 34.6142 215.7927 51.7709 10.2819 39.0859 14.5575 13.6645 6.9268 20.0393 5.3971 9.1364 144.0793 6.5547 4.3905 72.5210 54.7664 42.2171 28.6476 34.4857 35.0820 79.8414 28.8408 84.6005 16.5441 12.6590 20.8926 5.3013 2.5065 7.8117 21.1480 33.8472
temp: 298.150 k
press: 1.00000 atm
elementType: 7 7 7 6 6 6 6 6 6 6 6 6 6 6 6 6 6 1 1 1 1 1 1 1 1 1 1 1 1 1 1 1 1 1
symmnumber: 1
zpe: 746757.6 jmol-1
zpe.correction: 0.284425 hartree
zpe.thermalcorrener: 0.298744 hartree
zpe.thermalcorrenthalpy: 0.299688 hartree
zpe.thermalcorrgfe: 0.243264 hartree
zpe.sumelectzpe: -706.708103 hartree
zpe.sumelectthermal: -706.693784 hartree
zpe.sumelectthermalent: -706.692840 hartree
zpe.sumelectthermalfe: -706.749264 hartree
dipole: 2.6914 -0.2442 0.4435
dipole: 2.7386
quadrupole: -86.9133 -98.6165 -103.1374
quadrupole: 4.0767 0.8686 0.7346
quadrupole: 9.3091 -2.3941 -6.9150 4.0767 0.8686 0.7346
hfenergy: -706.9925281 hartree
pointgroup: C01 [X(C14H17N3)]
dipole: 1.0541618 0.1441373 -0.1698321 debye
polarizability: 290.287468|-15.239909|165.8404307|-10.3968686|18.6634363|100.0883732 unknown
InChI: InChI=1S/C14H17N3/c1-11-14(17-9-5-2-6-10-17)16-13-8-4-3-7-12(13)15-11/h3-4,7-8H,2,5-6,9-10H2,1H3
charge 0 multiplicity 1
34 atoms
N  1.838414 0.117765 -0.037237
N  -0.373921 0.890928 0.211057
N  -1.395895 -1.727023 -0.283061
C  4.705609 0.752618 0.019201
C  3.726226 1.261693 1.101457
C  4.173773 -0.555454 -0.610996
C  2.292333 1.406044 0.548876
C  2.732128 -0.360788 -1.124156
C  0.458541 -0.144458 -0.05944
C  -0.071193 -1.506444 -0.254918
C  -1.738151 0.654814 0.218972
C  -2.263003 -0.655689 -0.085953
C  0.809077 -2.738447 -0.3204
C  -2.646547 1.722201 0.497299
C  -3.672469 -0.866559 -0.127231
C  -4.02679 1.494086 0.449404
C  -4.544353 0.197538 0.133137
H  4.809765 1.522497 -0.773515
H  5.712494 0.594868 0.449034
H  3.711115 0.552104 1.951628
H  4.057956 2.241879 1.494524
H  4.819114 -0.875232 -1.451605
H  4.181833 -1.365474 0.144532
H  1.581346 1.693986 1.337986
H  2.255981 2.209232 -0.221561
H  2.736244 0.397501 -1.942513
H  2.341201 -1.293769 -1.552862
H  1.114332 -2.98115 -1.356475
H  1.722363 -2.61248 0.286801
H  0.230022 -3.597315 0.05483
H  -2.230692 2.707931 0.728925
H  -4.037121 -1.872516 -0.358677
H  -4.722696 2.315327 0.654844
H  -5.628037 0.040886 0.101495
