program: Gaussian 09
title: 000238490
version: EM64L-G09RevD.01
frameworkgroup: C1[X(C13H15N3)]
method: RPBEPBE
basis: SDD
operation: Freq
keyword: #pfreq=noraman
keyword: PBEPBE/SDD
title: #p freq=noraman PBEPBE/SDD
converged: YES YES NO NO
title: Mulliken charges:
elementType: N N N C C C C C C C C C C C C C H H H H H H H H H H H H H H H
charge: -0.175663 -0.064604 -0.025222 -0.462339 -0.455557 -0.346627 -0.361549 0.108487 0.055895 0.084385 0.037005 -0.766629 -0.346166 -0.331778 -0.218123 -0.235536 0.224071 0.230331 0.221044 0.229877 0.228014 0.219487 0.248278 0.232440 0.225676 0.223906 0.261897 0.250552 0.253595 0.226402 0.228453
chargesum: 0.00000
title: Mulliken charges with hydrogens summed into heavy atoms:
elementType: N N N C C C C C C C C C C C C C
charge: -0.175663 -0.064604 -0.025222 -0.007936 -0.004636 0.100874 0.119170 0.108487 0.055895 0.084385 0.037005 -0.055150 -0.095615 -0.078184 0.008279 -0.007083
polarizability: 2.73723887e+02 1.72344918e+01 1.61833619e+02 -5.38610048e+00 1.97798746e+00 8.44424346e+01
1716.lowfreq: -5.7336 -0.0007 -0.0004 0.0004 4.8468 13.6082 43.3974 72.3041 91.9555
frequency: 43.2886 72.1981 91.8372 125.8851 143.3486 182.6680 207.0408 260.3916 269.1101 285.7387 315.1453 324.9550 337.6556 448.5986 459.6538 490.2302 547.8113 558.1620 570.5845 578.7702 599.8738 676.7419 709.0760 718.6183 768.8378 787.9519 795.7671 856.6351 867.8896 874.0860 875.0564 918.4593 921.5507 955.0449 958.9580 984.8089 986.7939 1001.9456 1013.3103 1035.3585 1063.2068 1110.0749 1114.5715 1136.6580 1155.4532 1159.9836 1170.2551 1194.1132 1218.8498 1222.7675 1240.8960 1267.0982 1300.3995 1308.9793 1313.0499 1324.4897 1335.8990 1344.6409 1385.6609 1389.9371 1439.0155 1452.9739 1462.0762 1468.3557 1469.9078 1471.0618 1476.5105 1488.0664 1498.2901 1530.7500 1551.0336 1613.8449 2976.0063 2982.4636 2989.5572 3008.5476 3008.9633 3043.3040 3065.7291 3070.6723 3077.9516 3091.2212 3112.7530 3128.2940 3142.9172 3157.8366 3168.6235
redmass: 3.6053 3.1507 2.6938 3.7068 3.4206 1.3000 2.1557 1.7052 4.7578 3.2565 4.3178 4.2771 4.0935 4.9795 4.1303 4.3125 4.3713 3.6960 2.2739 4.6297 8.1849 5.5861 4.5003 3.3825 1.3298 3.5244 3.8050 1.7763 2.0021 2.3110 2.2189 1.8888 2.0082 2.7460 1.3670 2.0113 1.3142 1.9557 1.9085 1.5330 1.7791 1.7138 1.5953 2.4133 1.1493 1.6326 1.6611 3.3652 1.8932 1.4123 1.3273 2.3811 1.4280 1.6187 1.3852 3.7372 1.5280 2.0749 1.8246 2.3296 3.9280 1.4121 2.6126 2.0612 1.0941 1.1807 1.2285 1.0950 1.1777 4.7275 6.4905 6.6764 1.0565 1.0665 1.0424 1.0667 1.0618 1.1005 1.0960 1.0976 1.1009 1.1055 1.0982 1.0854 1.0891 1.0953 1.1004
irintensity: 0.9218 1.0616 0.6448 4.5294 1.3409 0.8769 7.6158 0.1548 3.4248 0.2589 2.5178 2.1302 2.9003 6.8240 3.3851 0.2957 0.6422 4.0963 0.6004 0.5324 10.6294 1.4160 7.2812 1.9055 95.4569 1.5548 5.4658 10.8814 2.4682 2.1651 2.0785 5.8076 3.7190 3.6148 2.7299 4.7145 0.0229 24.3298 2.0671 3.1175 2.1040 1.5534 1.5845 11.0332 4.1729 4.8073 14.4930 14.6307 7.1880 4.7518 7.9736 8.3715 0.7025 7.1243 3.6050 19.6213 25.2978 5.0869 70.7479 41.1909 257.0835 28.7213 142.8240 108.1191 17.0248 10.6635 3.5402 4.3051 14.3630 187.5995 19.8981 5.1638 36.4834 19.1292 59.6204 38.4932 27.5494 20.0944 18.4937 27.1681 38.4366 61.6777 10.4480 3.0223 7.8977 22.9904 34.2951
temp: 298.150 k
press: 1.00000 atm
elementType: 7 7 7 6 6 6 6 6 6 6 6 6 6 6 6 6 1 1 1 1 1 1 1 1 1 1 1 1 1 1 1
symmnumber: 1
zpe: 671844.0 jmol-1
zpe.correction: 0.255892 hartree
zpe.thermalcorrener: 0.269335 hartree
zpe.thermalcorrenthalpy: 0.270279 hartree
zpe.thermalcorrgfe: 0.215728 hartree
zpe.sumelectzpe: -667.485329 hartree
zpe.sumelectthermal: -667.471886 hartree
zpe.sumelectthermalent: -667.470942 hartree
zpe.sumelectthermalfe: -667.525493 hartree
dipole: 3.6087 -0.2879 0.3388
dipole: 3.6360
quadrupole: -77.6326 -92.3015 -96.7878
quadrupole: 3.6797 0.2370 0.1225
quadrupole: 11.2747 -3.3942 -7.8805 3.6797 0.2370 0.1225
hfenergy: -667.7412208 hartree
pointgroup: C01 [X(C13H15N3)]
dipole: 1.4265795 -0.0850272 0.0629552 debye
polarizability: 271.8162894|13.4376472|157.7186379|-21.851753|-17.972065|90.4650129 unknown
InChI: InChI=1S/C13H15N3/c1-10-13(16-8-4-5-9-16)15-12-7-3-2-6-11(12)14-10/h2-3,6-7H,4-5,8-9H2,1H3
charge 0 multiplicity 1
31 atoms
N  2.112684 -0.154372 -0.208345
N  -0.06676 -0.888439 0.151837
N  -1.103235 1.723046 -0.352593
C  4.405485 -0.116126 0.483133
C  4.082559 -1.486142 -0.16285
C  3.246537 0.791469 -0.003015
C  2.548486 -1.569578 -0.034857
C  0.758877 0.147652 -0.161291
C  0.209765 1.478016 -0.486792
C  -1.423548 -0.63729 0.252171
C  -1.949388 0.692707 0.051907
C  1.032144 2.603968 -1.084035
C  -2.324529 -1.696092 0.585038
C  -3.343287 0.942344 0.212563
C  -3.690637 -1.429747 0.7376
C  -4.205138 -0.106679 0.556213
H  4.38236 -0.205556 1.584844
H  5.391402 0.283768 0.191965
H  4.381107 -1.48856 -1.227554
H  4.587876 -2.32853 0.338581
H  2.991888 1.563888 0.744601
H  3.522069 1.301594 -0.945775
H  2.065242 -2.209266 -0.792083
H  2.233328 -1.950571 0.95693
H  1.730699 3.061774 -0.361043
H  1.626215 2.252212 -1.947333
H  0.334007 3.384354 -1.424223
H  -1.912506 -2.700349 0.726895
H  -3.706194 1.962989 0.053389
H  -4.377422 -2.242466 1.000501
H  -5.277184 0.07998 0.681722
