program: Gaussian 09
title: 000238471
version: EM64L-G09RevD.01
frameworkgroup: C1[X(C17H20N2O)]
method: RPBEPBE
basis: SDD
operation: Freq
keyword: #p
keyword: freq=noraman
keyword: PBEPBE/SDD
title: #p freq=noraman PBEPBE/SDD
converged: YES YES NO NO
title: Mulliken charges:
elementType: O N N C C C C C C C C C C C C C C C C C H H H H H H H H H H H H H H H H H H H H
charge: -0.195898 -0.076817 -0.019305 -0.297975 -0.444508 -0.344026 0.201513 0.088662 0.323224 -0.350378 -0.617323 -0.631296 -0.350164 -0.359952 -0.192503 -0.377169 -0.178471 -0.254386 -0.234496 -0.229208 0.226303 0.252524 0.241711 0.190969 0.191036 0.241373 0.221768 0.183710 0.222235 0.216147 0.183962 0.248851 0.237167 0.277833 0.238232 0.242121 0.231984 0.228512 0.232139 0.231900
chargesum: 0.00000
title: Mulliken charges with hydrogens summed into heavy atoms:
elementType: O N N C C C C C C C C C C C C C C C C C
charge: -0.195898 -0.076817 -0.019305 -0.071673 0.049726 0.037980 0.201513 0.088662 0.323224 -0.109004 0.010389 0.017665 -0.112998 -0.082119 0.045728 -0.135048 0.053513 -0.025874 -0.002357 0.002692
polarizability: 2.26418449e+02 3.29435277e+00 1.87495323e+02 -4.04448967e-01 -1.80260100e+01 1.70237906e+02
1716.lowfreq: -7.0005 0.0001 0.0003 0.0007 4.3805 10.5193 23.7338 29.3753 30.6088
frequency: 23.6897 29.0002 30.5298 36.4046 52.9488 65.8758 88.5829 120.0587 140.8919 166.2867 178.6625 206.0900 223.1108 240.0298 251.4110 253.8394 332.3180 341.5958 390.0696 400.1198 404.7125 421.3638 430.8070 455.2978 484.4610 542.9641 582.7040 609.1751 614.2826 649.0298 685.7615 695.3140 747.7927 751.4143 777.7133 790.3979 803.4969 838.5130 846.0073 852.9872 902.3198 938.9712 958.8898 960.5887 975.4357 986.7598 990.4558 1000.2783 1008.1987 1019.4107 1023.4674 1027.8512 1034.1790 1042.0669 1067.1312 1083.9391 1087.8752 1093.0760 1099.5079 1134.8944 1163.3368 1163.8570 1173.0051 1184.0792 1190.2188 1212.3007 1227.2224 1259.1665 1262.8001 1282.4728 1297.9626 1301.3819 1313.7942 1326.9557 1330.1392 1375.6911 1386.5455 1412.1625 1418.6627 1434.7320 1442.1457 1447.5174 1457.1102 1461.4396 1471.2109 1476.2785 1478.6096 1479.3188 1487.2155 1562.2943 1570.3973 1578.9300 1599.6312 1613.3682 2825.3799 2838.6529 2855.9957 2972.6267 2983.4391 3014.6596 3016.6972 3032.4433 3074.1406 3083.4127 3093.1788 3124.4866 3127.4705 3129.9764 3138.7438 3147.3359 3151.7967 3161.3423 3169.7512 3170.1115
redmass: 5.1372 3.8481 3.2272 3.5561 4.3549 4.3087 4.5534 2.6905 4.6477 4.2511 2.8009 3.4753 1.9692 1.4675 1.6972 2.0506 2.5922 5.1413 3.2171 2.8029 3.5494 3.9271 2.5886 3.9780 3.6054 4.5626 2.9028 7.1766 6.4797 6.0327 4.5151 1.6361 2.3067 1.5800 1.7348 2.8300 3.7668 2.3050 3.2635 1.2749 1.3281 1.4506 2.2148 2.4903 4.6818 1.3954 5.8826 1.3435 1.3507 2.1234 2.4441 2.0873 1.5651 2.1770 2.4468 1.6802 1.6190 1.4898 1.8796 1.4474 1.4521 1.2224 1.0764 1.3843 1.2400 1.7937 2.5259 2.3153 2.7421 1.8337 1.3167 1.8714 1.3928 1.6690 1.6996 1.4198 9.0156 1.9811 1.1452 2.2576 1.1690 1.7409 1.2019 1.0512 1.0808 1.0744 2.1473 1.0738 1.0580 5.8104 7.0118 6.0417 6.9194 6.9274 1.0683 1.0582 1.0582 1.0813 1.0870 1.0711 1.0600 1.0722 1.1011 1.1030 1.0999 1.0877 1.0851 1.0900 1.0885 1.0943 1.0926 1.0953 1.1011 1.1006
irintensity: 1.2536 0.8844 0.2783 0.4271 1.5632 0.4357 0.9316 1.3905 0.0834 0.2318 1.4606 1.1236 0.6034 3.7842 0.6398 2.5016 8.1130 7.7983 1.3414 0.2006 3.1589 0.4092 3.5863 1.7527 1.3464 14.6495 35.9832 2.0312 0.4433 6.0277 3.2697 69.4491 20.4403 41.0621 30.2596 4.9565 27.1233 11.2716 9.3513 0.7035 0.2192 2.9095 1.5614 0.6561 30.3900 0.7359 4.0322 0.2943 1.0573 17.9721 17.1752 18.4533 20.2842 4.8462 13.8070 4.8951 2.8853 10.1571 3.7022 12.6139 8.6360 1.8409 3.3697 32.1969 2.6150 8.8733 80.1139 73.1850 31.9727 33.4013 11.7250 1.6297 2.1971 11.7134 2.2424 11.9823 1.6913 24.7246 2.5559 17.4325 2.7608 26.1898 23.1528 19.9436 1.7015 6.7892 1.5470 14.4923 25.6461 24.6745 115.6649 19.8969 41.3979 14.6045 77.8038 73.8241 207.6434 14.9866 35.2439 51.8369 6.2346 48.0578 33.9381 27.1510 32.7384 14.5913 0.2230 4.0420 8.1910 24.5907 24.1075 23.3650 22.7329 16.9916
temp: 298.150 k
press: 1.00000 atm
elementType: 8 7 7 6 6 6 6 6 6 6 6 6 6 6 6 6 6 6 6 6 1 1 1 1 1 1 1 1 1 1 1 1 1 1 1 1 1 1 1 1
symmnumber: 1
zpe: 866961.2 jmol-1
zpe.correction: 0.330208 hartree
zpe.thermalcorrener: 0.349482 hartree
zpe.thermalcorrenthalpy: 0.350426 hartree
zpe.thermalcorrgfe: 0.279804 hartree
zpe.sumelectzpe: -843.041205 hartree
zpe.sumelectthermal: -843.021931 hartree
zpe.sumelectthermalent: -843.020986 hartree
zpe.sumelectthermalfe: -843.091609 hartree
dipole: 0.7746 4.3946 -2.9356
dipole: 5.3414
quadrupole: -104.5506 -117.2974 -115.0958
quadrupole: -2.9047 -1.2507 -0.1449
quadrupole: 7.7640 -4.9828 -2.7812 -2.9047 -1.2507 -0.1449
hfenergy: -843.3714128 hartree
pointgroup: C01 [X(C17H20N2O1)]
dipole: -0.2982003 -1.6317372 -1.2902126 debye
polarizability: 226.3056307|4.1898126|184.5071863|-0.4046266|19.1536422|173.3388608 unknown
InChI: InChI=1S/C17H20N2O/c1-19(2)13-11-15(16-10-6-7-12-18-16)17(20)14-8-4-3-5-9-14/h3-10,12,15H,11,13H2,1-2H3
charge 0 multiplicity 1
40 atoms
O  -0.476149 2.068531 1.423098
N  4.254474 1.323019 -0.351354
N  0.206012 -1.396671 1.238119
C  0.44793 0.542231 -0.252945
C  1.811204 1.116635 0.216386
C  2.998972 0.573131 -0.601457
C  0.3807 -0.97157 -0.052706
C  -0.715886 1.243789 0.498653
C  -2.136641 0.949117 0.096563
C  0.525429 -1.883179 -1.129644
C  5.311281 0.947077 -1.312067
C  4.72724 1.220782 1.045328
C  -2.4781 0.243191 -1.0880
C  -3.178683 1.432154 0.934039
C  0.489865 -3.270556 -0.870006
C  0.170846 -2.738337 1.475743
C  0.30698 -3.71289 0.460463
C  -3.831177 0.026739 -1.426515
C  -4.528728 1.209288 0.60126
C  -4.859711 0.505607 -0.582462
H  0.327579 0.751075 -1.336991
H  1.916857 0.886076 1.290639
H  1.788335 2.217352 0.122625
H  3.130865 -0.523439 -0.399949
H  2.770604 0.674416 -1.682616
H  0.670174 -1.508524 -2.149234
H  4.95446 1.116336 -2.344244
H  5.631006 -0.124415 -1.22827
H  6.202433 1.579966 -1.150766
H  5.654867 1.809413 1.16051
H  4.942734 0.166563 1.359682
H  3.976312 1.638039 1.735956
H  -1.696746 -0.134815 -1.754376
H  -2.897602 1.979984 1.839364
H  0.603087 -3.991222 -1.687113
H  0.025655 -3.033143 2.521678
H  0.269974 -4.778512 0.707333
H  -4.084244 -0.513222 -2.345555
H  -5.323052 1.58149 1.257511
H  -5.909755 0.33379 -0.844877
