program: Gaussian 09
title: 000238429
version: EM64L-G09RevD.01
frameworkgroup: C1[X(C11H9F3O2)]
method: RPBEPBE
basis: SDD
operation: Freq
keyword: #p
keyword: freq=noraman
keyword: PBEPBE/SDD
title: #p freq=noraman PBEPBE/SDD
converged: YES YES NO NO
title: Mulliken charges:
elementType: F F F O O C C C C C C C C C C C H H H H H H H H H
charge: -0.156806 -0.169269 -0.123164 -0.187528 -0.111874 -0.328537 0.128544 -0.694669 0.126117 0.332198 0.328917 -0.359936 -0.351245 -0.245461 -0.226593 -0.221185 0.276220 0.254285 0.235778 0.248493 0.253372 0.278668 0.237515 0.237991 0.238168
chargesum: 0.00000
title: Mulliken charges with hydrogens summed into heavy atoms:
elementType: F F F O O C C C C C C C C C C C
charge: -0.156806 -0.169269 -0.123164 -0.187528 -0.111874 -0.052317 0.128544 0.043887 0.126117 0.332198 0.328917 -0.106563 -0.072577 -0.007946 0.011398 0.016982
polarizability: 1.51524069e+02 1.59009406e+01 1.36585620e+02 -1.05331067e+01 5.57723086e+00 8.17592335e+01
1716.lowfreq: -4.9807 -0.0012 -0.0011 -0.0009 4.4443 6.9350 18.0533 38.0647 42.3069
frequency: 18.0485 38.0163 42.2848 60.7034 104.0329 149.5265 157.3905 182.6107 188.3478 203.7743 243.5810 282.8251 325.5766 341.3410 374.9150 401.1935 426.2725 444.4883 467.4852 505.0529 582.0474 612.9391 627.7882 657.4328 695.1033 716.5722 737.0305 757.7286 823.9957 859.3458 920.7572 946.4240 953.4281 976.3744 990.0030 994.5780 1008.0784 1013.2472 1026.5674 1059.1116 1074.7531 1086.4152 1093.9717 1163.1143 1176.0961 1194.7824 1229.8232 1276.1351 1296.5507 1325.2417 1388.4668 1390.0111 1436.6586 1463.8271 1470.0941 1480.8956 1574.3113 1598.5945 1612.9210 1652.4342 3011.4689 3012.2991 3116.8277 3124.0487 3133.7848 3145.0732 3156.2310 3165.6512 3174.3112
redmass: 14.3584 4.5917 6.6020 7.2495 7.8723 4.3758 5.1421 2.7959 1.5698 5.7389 3.6572 9.3470 5.1657 6.6700 13.0910 2.8164 4.0128 14.2128 8.0117 10.4642 5.9996 6.4011 6.2314 8.7194 1.8927 6.4602 4.7282 1.9586 2.6636 1.2501 6.4409 1.7658 2.3828 7.5925 5.1843 1.4720 1.7700 1.4428 2.2129 6.5306 2.5925 1.8178 1.6439 4.9309 1.0633 1.1254 2.6148 1.6304 1.7496 1.3209 1.1839 8.6134 2.2635 1.0484 1.0518 2.1849 6.9480 6.8158 6.7796 10.6113 1.0477 1.0678 1.1010 1.1018 1.0856 1.0885 1.0925 1.0956 1.1007
irintensity: 0.2719 0.1595 3.3661 0.0172 1.6947 0.5944 2.3536 6.8192 1.8558 3.4321 2.0593 0.8471 6.9294 0.3462 4.9717 0.2129 2.1042 4.3094 4.8414 4.3394 27.3600 0.0191 10.1154 3.4157 49.5782 0.8567 5.3536 52.6598 9.6324 2.9847 14.8889 36.8452 150.1694 277.5723 20.8830 7.8822 11.2351 2.2649 1.5809 143.2007 24.1010 32.0117 11.8004 75.4620 2.3024 13.4594 125.1745 64.9919 41.7032 7.2012 22.6896 3.4706 21.2620 20.8461 12.2405 0.8774 97.4820 73.8434 20.8339 81.3849 16.3921 2.3705 9.2643 8.9704 0.1488 8.3768 10.7339 12.8491 15.0256
temp: 298.150 k
press: 1.00000 atm
elementType: 9 9 9 8 8 6 6 6 6 6 6 6 6 6 6 6 1 1 1 1 1 1 1 1 1
symmnumber: 1
zpe: 460208.3 jmol-1
zpe.correction: 0.175284 hartree
zpe.thermalcorrener: 0.190400 hartree
zpe.thermalcorrenthalpy: 0.191344 hartree
zpe.thermalcorrgfe: 0.130775 hartree
zpe.sumelectzpe: -873.362279 hartree
zpe.sumelectthermal: -873.347163 hartree
zpe.sumelectthermalent: -873.346219 hartree
zpe.sumelectthermalfe: -873.406788 hartree
dipole: -2.1258 -1.2712 -2.2449
dipole: 3.3428
quadrupole: -83.3462 -93.7066 -96.3382
quadrupole: 10.1335 -4.0890 -0.1565
quadrupole: 7.7842 -2.5762 -5.2079 10.1335 -4.0890 -0.1565
hfenergy: -873.5375628 hartree
pointgroup: C01 [X(C11H9F3O2)]
dipole: 0.9047807 0.4241949 -0.8550501 debye
dipolederiv: -0.6823051 -0.1268959 -0.2191853 -0.0601111 -0.4425482 -0.0639295 -0.2228416 -0.1099188 -0.3973548 -0.589101 -0.0238543 0.0979605 -0.0760735 -0.4747567 0.2214459 0.1856786 0.1891263 -0.5143611 -0.4850885 0.220452 0.151215 0.2909699 -0.5550231 -0.2471621 0.1634604 -0.202416 -0.4586315 -0.6111032 0.0076198 -0.0390413 -0.1845903 -0.9993819 0.0297973 -0.0490238 0.1855454 -0.2696653 -0.372885 0.0793884 -0.0099768 0.0942449 -0.3226288 -0.0159844 0.1924891 -0.1531157 -0.6943236 -0.603452 0.115136 -0.0642045 0.3192893 -0.3613581 -0.2213869 -0.0578161 -0.0949621 -0.0386188 1.5101683 0.3175646 0.1129228 0.3625507 1.1673363 -0.0488779 0.2810455 -0.2102753 0.1095274 0.0551337 0.0617236 0.0982514 -0.0053355 0.0974469 0.0298895 0.0248144 -0.0772802 0.0058529 0.4241887 -0.3836363 -0.0399691 -0.4944479 0.5078839 0.1514685 -0.3059062 0.2302731 0.821344 -0.560886 -0.3782321 -0.0255735 -0.3156764 -0.3625921 -0.0045634 -0.0734409 -0.0153659 -0.0110117 1.6532301 0.0715159 -0.0752419 0.0704406 1.342017 0.1348035 -0.1852266 0.1824553 1.2421293 0.0285192 -0.005711 0.059613 0.1854935 0.0665403 0.0177729 0.0431212 -0.0372659 -0.1059443 0.0433158 0.1656759 -0.0089064 -0.1169558 0.045708 -0.0770442 0.0553383 -0.0050143 -0.0636902 -0.2775286 -0.093749 0.0001412 -0.0236646 0.1090317 -0.113572 -0.0192237 -0.1216569 -0.1082843 0.0899365 -0.0905768 0.1321513 -0.0880342 -0.2133587 -0.0070968 0.12292 -0.0141087 -0.0950714 0.0906563 0.0914265 0.0546406 0.0666263 0.0784996 -0.0418178 0.0580603 -0.0354116 -0.0857775 0.0397451 -0.0097473 0.0299109 -0.0178296 0.0389924 0.0936094 0.0313281 0.0736865 0.0019733 0.1115152 0.0095843 -0.0103208 -0.0357069 0.0477808 0.0198315 0.0251499 0.0663444 -0.05199 -0.0975988 -0.006425 -0.0654696 0.0458869 0.0923236 0.03704 -0.0685976 0.0083022 0.0822009 0.086235 0.0396215 0.0516434 0.0155433 -0.0101265 -0.0998128 0.0624928 -0.044458 0.0349661 0.0160743 0.0179507 -0.0722564 0.0139654 0.1001947 0.0117495 -0.0984209 0.005576 0.1066686 0.1281558 -0.0106899 -0.0097978 0.0438951 0.0216668 0.0608755 -0.0146438 0.0461448 0.1261236 0.0890301 0.0228905 -0.036055 -0.0055803 -0.0655861 0.0829894 -0.0294432 0.0881845 0.112961 -0.0728734 0.0178938 -0.0893542 0.0286688 0.0844106 0.0382483 -0.0932933 0.0355352 0.1075265 -0.0130824 -0.1089261 -0.0230974 -0.1135688 0.0075276 0.0117265 -0.0280209 0.0100757 0.1434511 unknown
polarizability: 150.2917425|17.0503158|135.0719859|14.0290525|-8.405316|84.5051946 unknown
InChI: InChI=1S/C11H9F3O2/c1-7(10(16)11(12,13)14)9(15)8-5-3-2-4-6-8/h2-7H,1H3
charge 0 multiplicity 1
25 atoms
F  -3.631565 0.314637 -0.910849
F  -1.865923 1.71486 -1.199836
F  -3.104948 1.824924 0.699174
O  0.748821 -2.65995 0.255447
O  -1.500818 -0.161814 1.66526
C  -0.956526 -1.107186 -0.544482
C  0.488507 -1.471964 -0.075226
C  -1.83785 -2.387805 -0.627068
C  -1.612752 -0.129761 0.424888
C  1.539336 -0.405421 -0.04046
C  -2.559823 0.940266 -0.226312
C  1.342964 0.894819 -0.579798
C  2.792523 -0.729847 0.550289
C  2.378912 1.851347 -0.523346
C  3.82271 0.226917 0.609401
C  3.618447 1.52166 0.071933
H  -0.903619 -0.641852 -1.547686
H  -1.911016 -2.862715 0.364157
H  -2.847707 -2.151897 -1.001345
H  -1.35861 -3.108624 -1.309377
H  0.398699 1.171984 -1.058433
H  2.927538 -1.736967 0.95767
H  2.220812 2.850074 -0.943699
H  4.7815 -0.029156 1.072507
H  4.419889 2.267369 0.116591
