program: Gaussian 09
title: 000238417
version: EM64L-G09RevD.01
frameworkgroup: C1[X(C3Cl4F2O)]
method: RPBEPBE
basis: SDD
operation: Freq
keyword: #p
keyword: freq=noraman
keyword: PBEPBE/SDD
title: #p freq=noraman PBEPBE/SDD
converged: NO YES NO NO
title: Mulliken charges:
elementType: Cl Cl Cl Cl F F O C C C
charge: 0.112912 0.135868 0.135834 0.112886 -0.086913 -0.086882 -0.066992 0.393826 -0.325284 -0.325256
chargesum: 0.00000
title: Mulliken charges with hydrogens summed into heavy atoms:
polarizability: 8.16658171e+01 1.14416271e+00 7.99034251e+01 -6.54843318e-03 4.80454128e-04 6.22864093e+01
1716.lowfreq: -15.8100 -7.5469 -6.3597 -0.0035 -0.0015 -0.0014 32.8005 51.5930 127.3839
frequency: 32.7383 51.5617 127.3827 152.9649 162.0410 201.7501 210.6216 274.3929 279.3527 321.3160 337.4935 342.7028 402.0286 464.5416 554.2178 621.8446 637.3667 712.3104 802.6459 890.4996 969.3065 1033.5423 1114.6445 1661.8217
redmass: 23.2938 27.7170 25.4213 21.3458 28.2567 23.0951 22.3797 23.4451 24.2373 18.5322 23.3876 23.8745 23.5190 19.7981 15.9473 13.5277 13.6722 13.2797 12.3067 12.3878 13.2823 13.2035 12.1853 13.2714
irintensity: 0.2447 0.0017 0.0000 2.9868 0.2355 0.3629 2.4353 4.9441 0.1047 0.8494 1.1068 0.0188 2.7482 12.0551 8.1716 142.7578 203.2197 10.4617 200.1293 35.7363 68.3411 182.1406 33.5244 57.8245
temp: 298.150 k
press: 1.00000 atm
elementType: 17 17 17 17 9 9 8 6 6 6
symmnumber: 1
zpe: 73923.8 jmol-1
zpe.correction: 0.028156 hartree
zpe.thermalcorrener: 0.039153 hartree
zpe.thermalcorrenthalpy: 0.040098 hartree
zpe.thermalcorrgfe: -0.010860 hartree
zpe.sumelectzpe: -2228.649413 hartree
zpe.sumelectthermal: -2228.638416 hartree
zpe.sumelectthermalent: -2228.637472 hartree
zpe.sumelectthermalfe: -2228.688429 hartree
dipole: -0.0003 0.0003 -0.0180
dipole: 0.0180
quadrupole: -81.8441 -80.7223 -88.8627
quadrupole: -0.4917 -0.0010 0.0012
quadrupole: 1.9656 3.0874 -5.0530 -0.4917 -0.0010 0.0012
hfenergy: -2228.6775693 hartree
pointgroup: C01 [X(C3Cl4F2O1)]
dipole: -0.0000983 0.0070918 0.000111 debye
dipolederiv: -0.2311837 0.0878905 0.1471003 0.0580281 -0.1392908 -0.1473196 0.0744126 -0.1390246 -0.6476066 -0.4629156 -0.2180273 -0.2181184 -0.214585 -0.2075126 -0.1611987 -0.2102744 -0.15692 -0.2486588 -0.4630486 0.2157925 -0.2200944 0.2124508 -0.2045039 0.1607679 -0.2122852 0.1565245 -0.2514997 -0.2312191 -0.0870056 0.1480778 -0.0576982 -0.1373084 0.1435617 0.0751624 0.1350806 -0.6496353 -0.3489811 -0.0587671 0.0305058 -0.1690038 -0.6661702 0.2524453 0.0715425 0.2303574 -0.4136651 -0.3494045 0.0596075 0.0305174 0.1702407 -0.6696146 -0.2502185 0.0707007 -0.2281784 -0.4097987 -0.4680079 0.000362 0.0578312 -0.0001244 -0.637593 0.0014778 -0.0287744 0.0017668 -0.1638321 0.8790377 -0.0007899 -0.2674335 -0.0001257 0.655518 -0.0025937 -0.1156525 -0.002764 -0.0940759 0.8376154 0.2951399 0.1449632 0.4686639 1.0039419 0.038846 0.1361774 0.017871 1.4390866 0.8381074 -0.2942027 0.1466506 -0.4678463 1.0025337 -0.0357683 0.1389909 -0.0147132 1.4396857 unknown
polarizability: 81.7562972|0.0252834|62.2866891|1.0682835|0.0673678|79.8126652 unknown
InChI: InChI=1S/C3Cl4F2O/c4-2(5,8)1(10)3(6,7)9
charge 0 multiplicity 1
10 atoms
Cl -1.774281 0.511276 1.739594
Cl -2.665912 -0.78551 -0.870066
Cl 2.666092 -0.775076 0.877418
Cl 1.775195 0.500274 -1.74309
F  -1.165733 1.391363 -0.711087
F  1.163193 1.398534 0.700084
O  0.001399 -1.899849 0.006569
C  0.000453 -0.662562 0.00191
C  -1.325166 0.159719 -0.037599
C  1.324861 0.161931 0.036365
