program: Gaussian 09
title: 000238435
version: EM64L-G09RevD.01
frameworkgroup: C1[X(C12H9NO2S)]
method: RPBEPBE
basis: SDD
operation: Freq
keyword: #p
keyword: freq=noraman
keyword: PBEPBE/SDD
title: #p freq=noraman PBEPBE/SDD
converged: YES YES NO NO
title: Mulliken charges:
elementType: S O O N C C C C C C C C C C C C H H H H H H H H H
charge: 0.340738 -0.214393 -0.219841 0.006948 -0.661301 0.167401 0.302141 0.317133 -0.273738 -0.251863 -0.285180 -0.298410 -0.146367 -0.509586 -0.337241 -0.354069 0.268263 0.267090 0.299735 0.272430 0.283978 0.255755 0.273460 0.248415 0.248502
chargesum: 0.00000
title: Mulliken charges with hydrogens summed into heavy atoms:
elementType: S O O N C C C C C C C C C C C C
charge: 0.340738 -0.214393 -0.219841 0.006948 -0.125947 0.167401 0.302141 0.317133 -0.273738 0.047871 -0.012750 -0.014432 0.109388 -0.236126 -0.088826 -0.105567
polarizability: 2.08523898e+02 1.41687747e+01 1.64322475e+02 -5.51006137e+00 -4.99189938e+00 9.70692397e+01
1716.lowfreq: -3.8285 0.0010 0.0018 0.0024 4.2603 6.7091 21.6046 49.0095 61.7469
frequency: 21.5724 48.9795 61.7111 71.7960 125.1495 143.6704 156.2202 179.3474 217.3374 302.7312 367.0814 378.8066 416.8930 432.9047 453.5955 481.5057 517.8666 563.9815 587.3155 641.3189 646.7904 658.5542 691.5023 715.0723 730.3710 743.8343 786.3440 824.4462 849.5365 859.2581 896.7977 916.6639 934.4560 955.1031 960.3444 985.3956 991.1349 1028.1679 1062.1814 1071.7135 1090.8315 1094.7208 1137.7522 1218.2686 1227.5354 1236.7198 1262.1987 1293.9257 1299.1095 1333.0113 1347.2413 1401.7665 1450.7505 1457.1126 1466.7426 1517.1969 1541.5478 1572.6462 1577.2548 1591.6963 3041.3883 3113.6860 3139.1055 3141.4553 3160.3106 3171.8030 3171.9135 3190.8056 3232.6978
redmass: 8.0576 5.1747 5.0683 8.4390 9.4670 7.1435 6.3357 6.6953 5.2936 8.6923 2.5170 3.9562 6.4915 4.9008 5.1480 5.8588 6.1409 3.1506 3.6435 6.4737 5.1047 6.9443 7.5061 5.3288 1.1769 3.6263 2.9585 3.6229 1.8232 1.4064 1.2546 3.2932 1.4737 3.3779 4.5638 1.4743 1.4453 3.2342 1.9597 1.7206 1.3125 1.4882 1.3892 1.5428 1.8462 1.5149 1.7330 2.9336 9.1216 1.3785 2.4741 1.8859 5.9225 1.3050 1.5197 5.6664 7.6992 8.8935 5.4778 8.4751 1.0575 1.1050 1.0879 1.0907 1.0975 1.0961 1.0930 1.0964 1.1003
irintensity: 1.0239 1.2845 2.3259 1.7793 2.5587 5.0995 1.0721 1.0185 14.7617 0.4771 0.2678 0.5172 0.1803 5.7623 3.3272 7.3801 22.7720 3.5108 45.5679 3.6345 3.7434 1.3829 7.2951 3.6869 99.2880 0.8926 10.4001 44.6229 46.4083 17.0675 1.2075 46.0916 13.6661 1.3314 8.5458 1.5347 1.3631 68.1712 15.2700 46.6999 16.2940 7.8432 4.5026 112.8541 64.9788 198.1289 119.0686 45.2065 0.6025 7.9141 8.7334 30.5167 100.7922 19.2847 13.5278 45.8646 72.3864 238.6950 13.6584 13.5644 2.7528 5.2391 21.5103 5.1832 10.4680 11.9892 1.3909 5.3489 0.3609
temp: 298.150 k
press: 1.00000 atm
elementType: 16 8 8 7 6 6 6 6 6 6 6 6 6 6 6 6 1 1 1 1 1 1 1 1 1
symmnumber: 1
zpe: 472277.6 jmol-1
zpe.correction: 0.179881 hartree
zpe.thermalcorrener: 0.193600 hartree
zpe.thermalcorrenthalpy: 0.194545 hartree
zpe.thermalcorrgfe: 0.137201 hartree
zpe.sumelectzpe: -1064.790982 hartree
zpe.sumelectthermal: -1064.777262 hartree
zpe.sumelectthermalent: -1064.776318 hartree
zpe.sumelectthermalfe: -1064.833662 hartree
dipole: 2.8900 2.0730 0.6350
dipole: 3.6128
quadrupole: -95.2040 -104.2269 -97.2388
quadrupole: 1.7173 -7.9988 -1.8747
quadrupole: 3.6859 -5.3370 1.6511 1.7173 -7.9988 -1.8747
hfenergy: -1064.9708627 hartree
pointgroup: C01 [X(C12H9N1O2S1)]
dipole: 1.2138026 -0.4314065 0.6007431 debye
dipolederiv: 0.1347093 -0.0182569 -0.058165 -0.0368755 0.0587664 0.1313643 0.0034182 0.1738201 -0.1306501 -0.6980344 0.1412453 -0.0876245 0.2288789 -0.3764138 0.0552914 0.0479225 0.2080917 -0.8085356 -0.7588152 -0.1188721 -0.1601859 -0.1383455 -0.3803125 0.202776 -0.2854193 -0.0171531 -0.8780099 -0.3287356 0.0096714 -0.0048242 0.0673478 -0.2588575 0.0051271 -0.0090506 0.0023717 -0.215708 -0.7617 -0.1530093 0.3998003 -0.2289466 -0.1474459 0.0999121 0.6724108 0.1029475 -0.3610106 1.5143038 -0.4302013 -0.0673342 -0.8443016 0.2726565 0.0826885 -0.4404669 -0.1491603 0.9671115 1.5565435 0.5180443 0.2799436 0.9208264 0.5354077 -0.3243081 0.443647 -0.030601 0.9113415 -0.4866932 0.2012111 -0.0868236 0.3115753 -0.0874276 0.0110319 -0.0124697 0.0005939 0.0379529 -0.7573027 -0.0980412 -0.3828147 -0.0715666 -0.0422614 -0.2696978 -0.6570307 -0.3472256 -0.163433 0.2863832 0.2056272 0.0302513 0.051493 -0.0667597 0.0435003 0.3741878 0.1902821 -0.059605 -0.1757436 0.0196265 0.228074 0.0569826 -0.0532041 -0.1106763 -0.1365723 0.0201915 -0.0187852 -0.0756836 0.0065025 -0.1958318 0.0309171 -0.0666929 0.0790772 0.087093 -0.0192597 -0.1526388 -0.332255 -0.1366858 0.1096911 -0.2599577 -0.282396 0.0284738 0.2284632 0.0546585 -0.0137703 -0.1766114 0.0358476 0.1479776 0.1412454 -0.0814351 -0.1429442 -0.1400691 -0.2898989 0.1887337 0.1998926 -0.0950433 -0.3035255 -0.1440376 -0.0256398 0.1294144 -0.1390667 0.0341858 0.141714 0.0324739 -0.0663677 0.2417926 -0.089012 -0.0171311 -0.1734004 0.1280015 -0.0729637 0.2969221 0.0111852 0.0852388 -0.0344535 0.0613242 0.0512634 0.0071094 -0.0518888 0.0662373 0.0683447 0.03779 -0.0628573 -0.0623079 -0.0477948 0.0845767 -0.0083023 -0.0718654 -0.0510244 0.0222791 0.2034535 -0.051122 0.0237121 -0.0512818 0.1125361 0.0308562 0.0317991 0.0548401 0.0981983 0.151595 0.0257789 -0.0634858 0.0153581 0.1317948 0.0405887 -0.0061777 0.0170138 0.0091069 0.1814332 0.0321973 0.0767828 0.0358227 0.1166869 -0.0091903 0.0368481 -0.0153148 0.0620456 0.0868828 -0.0326528 -0.0683787 -0.0168816 0.1532042 0.0512144 -0.1086792 0.0337689 -0.0027747 0.0660831 -0.0874666 -0.0255353 -0.0775708 0.132793 0.0283627 -0.0434959 0.0212298 0.1129301 0.0128925 0.0420665 0.0986737 0.0517716 0.1186121 -0.0317239 0.0902029 -0.0231552 -0.0325356 0.0759531 0.0275187 -0.0354085 0.033029 0.1176794 0.0434547 -0.0417417 0.035524 -0.0792239 unknown
polarizability: 210.1588083|6.0551531|101.6972463|12.5275173|-16.424242|158.0595578 unknown
InChI: InChI=1S/C12H9NO2S/c14-10(9-3-5-13-6-4-9)8-11(15)12-2-1-7-16-12/h1-7H,8H2
charge 0 multiplicity 1
25 atoms
S  3.361808 0.999249 -1.342349
O  -0.196791 -1.454392 1.811099
O  0.762057 -0.276086 -2.366411
N  -4.367801 0.67445 -0.207709
C  0.290945 -1.836397 -0.54008
C  -0.579394 -1.310331 0.613289
C  1.120212 -0.725585 -1.235111
C  -1.879536 -0.629249 0.293322
C  2.309707 -0.241699 -0.535578
C  2.801866 -0.570137 0.733962
C  -2.752718 -0.28609 1.35998
C  -2.272437 -0.297959 -1.030206
C  3.997489 0.137263 1.084337
C  4.427831 1.006687 0.085566
C  -3.973649 0.352725 1.064237
C  -3.512988 0.352367 -1.223783
H  0.965806 -2.597632 -0.117014
H  -0.333029 -2.297767 -1.322423
H  2.295285 -1.274118 1.399602
H  -2.465956 -0.523118 2.388856
H  -1.628686 -0.507855 -1.890176
H  4.519494 0.013076 2.035478
H  5.302519 1.655855 0.088282
H  -4.674727 0.624264 1.860837
H  -3.845007 0.630078 -2.230006
