program: Gaussian 09
title: 000238434
version: EM64L-G09RevD.01
frameworkgroup: C1[X(C12H8Br2OS2)]
method: RPBEPBE
basis: SDD
operation: Freq
keyword: #p
keyword: freq=noraman
keyword: PBEPBE/SDD
title: #p freq=noraman PBEPBE/SDD
converged: YES YES NO NO
title: Mulliken charges:
elementType: Br Br S S O C C C C C C C C C C C C H H H H H H H H
charge: 0.091953 0.087258 0.281181 0.383150 -0.258900 0.510240 -0.240588 -0.394480 -0.832775 0.254254 -0.273457 -0.273400 -0.043673 -0.257873 -0.506292 -0.046272 -0.523007 0.198056 0.231871 0.231257 0.320499 0.273177 0.264639 0.257035 0.266146
chargesum: 0.00000
title: Mulliken charges with hydrogens summed into heavy atoms:
elementType: Br Br S S O C C C C C C C C C C C C
charge: 0.091953 0.087258 0.281181 0.383150 -0.258900 0.510240 -0.240588 -0.196423 -0.049148 0.254254 -0.273457 -0.000223 0.220967 -0.000838 -0.506292 0.219873 -0.523007
polarizability: 4.58725356e+02 1.03906683e+01 2.20971062e+02 2.18193983e-01 6.89874163e-02 7.19154292e+01
1716.lowfreq: -6.8297 -4.7809 -0.6660 -0.0018 0.0006 0.0008 19.7393 26.3308 30.8225
frequency: 19.7013 26.2675 30.8177 51.8845 70.2651 95.5545 98.6651 137.1941 141.8190 153.8691 201.4939 234.1219 237.7893 245.5220 276.2712 299.4370 334.9393 369.6423 411.3499 432.4234 460.9609 486.7607 529.2450 552.0333 571.2177 584.6371 635.7069 638.0011 674.6392 691.4623 707.8138 803.1990 807.4306 808.3953 874.9757 878.2188 899.9160 902.0478 914.9152 925.8050 998.7622 1041.9836 1046.8001 1085.0390 1087.1267 1194.7032 1203.0032 1225.3801 1266.7705 1303.5193 1320.1359 1387.4658 1394.0870 1445.1098 1446.5360 1464.4439 1495.5241 1505.8542 1531.2759 1537.9754 1602.3728 2980.0040 3057.4106 3116.7580 3124.5573 3176.5911 3183.8502 3199.8419 3203.5783
redmass: 6.3447 6.6523 18.7296 6.4998 5.1009 14.5391 14.8805 1.2508 3.0913 15.3921 11.0355 9.9133 6.9385 7.2704 5.8141 8.1915 8.1114 5.0956 6.4208 5.8027 6.2667 7.5576 3.0119 3.1190 7.5529 2.8087 10.6964 7.2541 6.8849 7.1712 3.7079 1.3116 1.2584 5.3114 1.6826 4.6142 1.4385 1.4227 5.5647 6.1789 4.1893 1.6248 1.5029 1.5971 1.5967 1.8695 1.4428 1.9359 3.2409 3.3342 4.1778 1.2224 1.7206 1.7151 7.1042 2.8926 1.0481 4.9060 5.4908 5.4013 5.2779 1.0385 1.0967 1.0878 1.0983 1.0915 1.0910 1.0998 1.0998
irintensity: 3.9628 0.1058 0.0445 0.0199 0.0396 0.9126 0.5162 2.8031 0.4939 0.0430 1.8679 3.7147 0.6626 0.9187 0.6423 19.4922 4.0699 11.6793 4.5657 3.3516 32.1406 11.2600 0.4451 0.0227 4.0418 1.3511 0.9227 16.8364 0.6524 5.9059 4.6307 69.5018 47.3338 63.1581 32.9146 11.6357 0.0039 0.3078 65.9239 53.5314 56.8301 0.7483 1.6792 2.8685 59.6735 27.6021 11.7090 180.4844 42.6389 58.1138 42.6107 46.8824 40.8983 361.8273 535.4895 33.1268 19.6043 68.9058 24.7895 49.7536 597.9727 33.6795 14.1833 15.3210 7.3000 6.7573 3.7084 1.3664 0.9814
temp: 298.150 k
press: 1.00000 atm
elementType: 35 35 16 16 8 6 6 6 6 6 6 6 6 6 6 6 6 1 1 1 1 1 1 1 1
symmnumber: 1
zpe: 423734.5 jmol-1
zpe.correction: 0.161392 hartree
zpe.thermalcorrener: 0.178883 hartree
zpe.thermalcorrenthalpy: 0.179827 hartree
zpe.thermalcorrgfe: 0.110956 hartree
zpe.sumelectzpe: -1359.089865 hartree
zpe.sumelectthermal: -1359.072374 hartree
zpe.sumelectthermalent: -1359.071430 hartree
zpe.sumelectthermalfe: -1359.140301 hartree
dipole: 3.4180 -1.5317 0.0283
dipole: 3.7457
quadrupole: -123.4776 -127.8478 -136.7997
quadrupole: 17.1709 0.0451 0.0646
quadrupole: 5.8975 1.5272 -7.4247 17.1709 0.0451 0.0646
hfenergy: -1359.2512572 hartree
pointgroup: C01 [X(C12H8Br2O1S2)]
dipole: 1.2629777 -0.7414375 -0.1637803 debye
dipolederiv: -0.3745826 0.2942468 0.0741746 0.5561526 -0.4099109 -0.1349964 0.1714337 -0.1558209 0.0251865 -0.9058829 -0.1312491 -0.1242669 -0.1127499 -0.0173411 -0.0387909 -0.1177073 -0.0402177 0.0405169 -0.1150933 -0.0869106 -0.055731 -0.0089203 -0.2222016 -0.1420799 -0.0229132 -0.1489791 0.0971963 -0.0354704 0.0382932 -0.0048835 0.1796875 -0.0522842 -0.0794184 0.0472201 -0.0904293 0.1740489 -1.0618337 0.0497347 -0.0404723 0.1480853 -0.9284909 -0.2125395 -0.0037504 -0.2198728 -0.3956379 1.5973721 -0.3345354 -0.0036246 0.1230004 0.3778057 0.1228026 0.1700245 0.0873949 0.1166782 -0.8328228 0.3360897 0.0739026 0.118368 0.1339074 0.1282459 -0.014032 0.1447949 -0.1227046 -2.0709798 0.2620606 -0.0500915 -0.1952398 -0.1035633 0.0212432 -0.2197085 0.0584523 -0.2024371 -0.2446558 0.008126 -0.0221644 0.0387891 -0.2362416 -0.1061328 -0.0155594 -0.1106552 0.01589 2.8192605 0.1014035 0.2424515 0.1398785 0.9669025 0.2897858 0.25676 0.2869507 0.3292293 -0.564033 -0.4953751 -0.2127394 -1.2391785 -0.2706925 -0.1369623 -0.4857429 -0.0792134 -0.229161 0.450895 -0.2938454 -0.0648836 -0.1607769 0.0062088 0.0348122 -0.014523 0.0241501 -0.1130369 -0.1459437 0.1477873 0.0510959 0.6550789 -0.5253131 -0.1115408 0.2427753 -0.1512497 -0.1275751 0.3251528 0.076757 0.0612662 0.666472 -0.0162678 0.0822546 0.2770953 0.0360739 -0.0629796 0.3255736 -0.2451238 -0.041741 -0.8964486 0.8064149 0.3283765 -0.2883541 0.3806918 -0.1415747 -1.0726079 0.0122105 -0.0711859 0.2236231 -0.0355391 0.0440737 0.0061058 0.0274771 -0.0976064 1.4375923 0.2062755 0.2095282 -0.3329125 0.1906751 0.1420025 0.0124144 0.1842912 -0.2002323 0.1006247 -0.0081134 -0.0069682 0.0660579 -0.0741877 -0.0777519 0.0204022 -0.0840145 0.1244047 0.0328899 -0.0184622 -0.1162976 -0.000817 0.0747666 0.0264781 -0.1093519 -0.0111261 -0.0547378 -0.0044684 -0.1016689 0.0816303 -0.0769487 0.0386858 0.027873 0.0917604 0.0625725 0.0189646 0.1568428 0.148641 0.0555543 0.0571496 0.1092276 0.0007435 0.0233689 0.0084254 0.1253413 0.1466598 -0.0140936 -0.0081758 -0.0037587 -0.0139495 -0.0731245 -0.0040106 -0.0739387 0.1516098 -0.0407417 -0.0035663 -0.0210384 -0.0184113 0.1222046 -0.0292189 -0.0265044 -0.0278455 0.1830385 -0.005198 0.0705121 0.0109096 0.1321726 0.0777019 -0.029088 0.0334526 -0.0338775 0.1754321 0.0814505 -0.0191939 -0.0162491 -0.0583532 0.0014825 -0.0770475 -0.0306551 -0.0740343 0.1701463 unknown
polarizability: 455.8960286|-25.580902|204.7153676|20.7272272|47.1506872|91.0004513 unknown
InChI: InChI=1S/C12H8Br2OS2/c1-7(9-2-4-11(13)16-9)6-8(15)10-3-5-12(14)17-10/h2-6H,1H3
charge 0 multiplicity 1
25 atoms
Br 5.286877 -3.12046 -0.51637
Br -6.76331 -0.953485 -0.651739
S  2.487471 -1.564416 -0.164649
S  -4.165607 0.765152 0.181336
O  -1.621149 2.082228 0.862435
C  1.187845 0.886562 0.648033
C  2.439272 0.150844 0.476153
C  -0.025956 0.297231 0.337137
C  1.323682 2.303562 1.179733
C  -1.372146 0.892838 0.448005
C  -2.50702 0.032702 0.043954
C  3.739876 0.586841 0.747721
C  4.776286 -0.367669 0.475314
C  -2.575877 -1.276179 -0.4408
C  4.280319 -1.565482 -0.015687
C  -3.906026 -1.738345 -0.71446
C  -4.864195 -0.771258 -0.435756
H  -0.007001 -0.734106 -0.037512
H  1.804128 2.298181 2.176379
H  1.959894 2.910061 0.508171
H  0.335613 2.775589 1.262146
H  3.950619 1.583836 1.1397
H  5.839011 -0.178623 0.634819
H  -1.697552 -1.905051 -0.602423
H  -4.144153 -2.732357 -1.096842
