program: Gaussian 09
title: 000238438
version: EM64L-G09RevD.01
frameworkgroup: C1[X(C12H17NO2)]
method: RPBEPBE
basis: SDD
operation: Freq
keyword: #p
keyword: freq=noraman
keyword: PBEPBE/SDD
title: #p freq=noraman PBEPBE/SDD
converged: YES YES NO NO
title: Mulliken charges:
elementType: O O N C C C C C C C C C C C C H H H H H H H H H H H H H H H H H
charge: -0.268656 -0.250278 -0.007926 -0.146200 -0.409241 -0.555897 -0.716114 0.508065 0.234119 -0.370088 -0.341287 -0.264191 -0.330914 -0.337824 -0.661978 0.234860 0.236623 0.215751 0.236018 0.203920 0.226123 0.224181 0.237527 0.232368 0.246792 0.234501 0.224254 0.235959 0.236944 0.218247 0.227379 0.246965
chargesum: 0.00000
title: Mulliken charges with hydrogens summed into heavy atoms:
elementType: O O N C C C C C C C C C C C C
charge: -0.268656 -0.250278 -0.007926 0.088660 0.043133 -0.115959 -0.028283 0.508065 0.234119 -0.137720 -0.094496 0.194563 -0.094956 -0.100880 0.030613
polarizability: 1.78236081e+02 1.59310329e+00 1.16246753e+02 3.54511274e+00 -1.46875087e+01 1.20678948e+02
1716.lowfreq: -8.6693 -0.0003 0.0002 0.0004 5.6679 7.4164 18.2660 20.4180 27.1391
frequency: 18.2182 19.8755 27.0705 61.1396 75.1346 77.1663 109.9853 166.7258 183.3242 204.9812 223.7758 244.7816 267.2924 319.9561 335.7368 369.3915 375.7305 404.7961 479.6394 524.1435 589.4030 606.6387 663.6919 708.3100 746.3134 750.3576 789.4434 803.6000 817.3697 824.3165 856.6032 887.8493 924.0377 960.2265 960.7974 974.0300 976.5734 1006.0572 1016.6476 1050.5729 1062.7671 1078.8361 1090.8713 1095.2442 1106.8096 1125.8997 1156.2828 1184.4580 1216.6661 1228.3655 1260.2959 1277.8328 1279.6045 1297.8042 1313.8356 1336.4393 1338.3999 1345.7718 1358.8897 1386.8016 1391.2336 1405.1825 1455.3932 1457.1557 1463.5625 1466.6018 1473.5808 1478.2644 1482.5146 1484.5215 1557.3744 1589.2713 1630.9396 2985.3969 2986.4690 2992.9824 2995.7027 3007.8562 3029.0848 3038.5385 3065.2886 3085.7848 3088.1866 3092.4201 3095.4957 3118.5951 3120.9588 3123.5497 3142.8667 3149.9552
redmass: 4.6372 3.9526 4.1163 2.7206 4.3891 4.2530 3.2343 3.6166 1.5648 1.4534 1.4790 2.6605 2.4470 2.7530 3.0618 2.5005 3.7925 3.4878 3.2781 3.7324 4.0316 3.1949 6.9095 5.3547 1.8484 3.4126 1.3652 2.3387 1.7945 1.9026 2.5573 1.2485 1.6577 5.0840 1.5100 1.5554 1.4861 3.0633 3.3125 1.6972 2.1923 2.9297 1.6148 2.2516 3.4384 1.4305 1.6738 1.6144 1.3919 2.0636 1.3070 1.3074 1.1484 1.4860 4.2475 1.3290 1.3390 1.3943 1.3886 1.2104 1.2343 2.0464 1.1026 1.0899 1.0441 1.9769 1.0505 1.0921 1.0652 1.0522 6.6893 5.7170 8.7067 1.0507 1.0431 1.0360 1.0607 1.0834 1.0593 1.0996 1.1042 1.1003 1.0975 1.1033 1.1005 1.1061 1.0871 1.0880 1.0963 1.0994
irintensity: 0.6367 0.1316 0.5642 0.9864 0.9811 0.3592 3.4217 1.1984 3.0541 0.6472 0.4262 1.0897 0.3469 11.4915 7.6108 0.0419 3.2596 6.0681 6.5216 13.4276 13.0462 1.4759 0.5207 3.7374 11.4036 1.2714 6.1815 25.0498 0.7504 16.2793 18.7607 0.0478 0.4441 2.7859 2.2799 7.2745 0.5514 14.6601 22.1181 21.0462 3.3961 27.4013 27.0908 74.1877 270.9519 26.9080 12.8042 31.1503 2.7718 2.1099 7.8541 3.3646 9.1109 6.8262 0.7737 6.5962 7.7113 3.3374 4.0593 19.4222 20.1826 16.8957 9.8084 6.1382 14.4462 10.2277 15.8723 8.0375 18.8353 13.8891 12.9746 67.6632 133.8057 16.8508 15.5157 18.5549 38.5255 15.8982 32.7971 1.9845 22.8908 32.6291 37.9292 0.8980 28.8207 34.5545 8.4770 11.6858 55.2860 0.7087
temp: 298.150 k
press: 1.00000 atm
elementType: 8 8 7 6 6 6 6 6 6 6 6 6 6 6 6 1 1 1 1 1 1 1 1 1 1 1 1 1 1 1 1 1
symmnumber: 1
zpe: 702197.8 jmol-1
zpe.correction: 0.267453 hartree
zpe.thermalcorrener: 0.283384 hartree
zpe.thermalcorrenthalpy: 0.284328 hartree
zpe.thermalcorrgfe: 0.220642 hartree
zpe.sumelectzpe: -671.533505 hartree
zpe.sumelectthermal: -671.517574 hartree
zpe.sumelectthermalent: -671.516630 hartree
zpe.sumelectthermalfe: -671.580316 hartree
dipole: -4.4869 1.0654 -1.7657
dipole: 4.9381
quadrupole: -101.4919 -86.9929 -88.5470
quadrupole: 6.7982 -3.3050 -1.1733
quadrupole: -9.1479 5.3510 3.7969 6.7982 -3.3050 -1.1733
hfenergy: -671.8009579 hartree
pointgroup: C01 [X(C12H17N1O2)]
dipole: 1.7875782 -0.3276377 -0.6868005 debye
polarizability: 178.3926455|1.568771|112.5846862|-1.6044108|13.699973|124.1844497 unknown
InChI: InChI=1S/C12H17NO2/c1-3-15-12(14)10(2)4-5-11-6-8-13-9-7-11/h6-10H,3-5H2,1-2H3
charge 0 multiplicity 1
32 atoms
O  3.645566 -0.100188 -0.350785
O  2.066863 0.407089 1.290315
N  -4.751043 0.539059 0.195849
C  1.60667 -1.379046 -0.376749
C  0.093597 -1.195492 -0.119912
C  -0.499128 0.071219 -0.798073
C  2.113258 -2.748463 0.160451
C  -1.971244 0.251723 -0.472243
C  2.413428 -0.262935 0.288079
C  -2.993769 -0.090349 -1.392358
C  -2.382836 0.742405 0.794722
C  4.571556 0.927987 0.222126
C  -4.349248 0.067187 -1.022009
C  -3.759756 0.868157 1.080055
C  4.282859 2.307007 -0.377121
H  1.818841 -1.336279 -1.462633
H  -0.078411 -1.135946 0.971189
H  -0.441099 -2.092648 -0.487333
H  0.066986 0.954044 -0.445436
H  -0.357967 -0.000813 -1.893853
H  1.936155 -2.831475 1.248121
H  1.571668 -3.571003 -0.339799
H  3.192664 -2.875435 -0.030907
H  -2.741117 -0.471052 -2.38886
H  -1.638469 1.029341 1.546596
H  4.453497 0.934152 1.319951
H  5.572021 0.557505 -0.052951
H  -5.153992 -0.189296 -1.721063
H  -4.09801 1.24877 2.050864
H  5.028153 3.036926 -0.010088
H  4.341998 2.278275 -1.478823
H  3.281206 2.660772 -0.080524
