program: Gaussian 09
title: 000238413
version: EM64L-G09RevD.01
frameworkgroup: C1[X(C8H9F3O2)]
method: RPBEPBE
basis: SDD
operation: Freq
keyword: #pfreq=noraman
keyword: PBEPBE/SDD
title: #p freq=noraman PBEPBE/SDD
converged: YES YES NO NO
title: Mulliken charges:
elementType: F F F O O C C C C C C C C H H H H H H H H H
charge: -0.150799 -0.166317 -0.124130 -0.167391 -0.117003 -0.271316 -0.426843 -0.410233 -0.397341 -0.509813 0.195436 0.113018 0.317824 0.279279 0.244244 0.231981 0.230047 0.200230 0.221743 0.224956 0.255545 0.226883
chargesum: 0.00000
title: Mulliken charges with hydrogens summed into heavy atoms:
elementType: F F F O O C C C C C C C C
charge: -0.150799 -0.166317 -0.124130 -0.167391 -0.117003 0.007963 0.049383 0.020043 0.049359 -0.027385 0.195436 0.113018 0.317824
polarizability: 1.00223220e+02 -2.59196799e-01 8.54127441e+01 7.72112990e+00 2.71851804e-01 7.86341123e+01
1716.lowfreq: -0.0012 -0.0007 -0.0006 6.6175 10.1285 22.3279 29.2440 45.0137 63.1558
frequency: 26.7060 44.9725 63.0492 108.0300 130.1437 173.5347 205.3978 252.0951 264.8975 291.9433 348.4505 394.0364 410.2284 433.4132 470.0119 493.3358 516.5782 628.1982 639.9056 672.8927 756.1929 773.0293 842.8171 853.4198 889.5737 900.6709 954.7966 981.0695 1014.5465 1030.2586 1067.3573 1069.6517 1091.4082 1107.8715 1117.4179 1177.5522 1208.6393 1219.3257 1249.0552 1264.3709 1294.4329 1311.3699 1338.8796 1342.5281 1350.1441 1449.0414 1466.4380 1468.3425 1478.4791 1625.2281 1672.6966 2977.5082 2981.7229 2991.0467 2993.2747 3004.7185 3044.4225 3056.2346 3070.0522 3082.9286
redmass: 13.0470 5.3096 5.7322 5.4760 6.4429 3.5600 14.2832 6.2950 6.3414 1.8491 6.5483 6.8550 3.5280 10.0391 2.1105 6.2604 8.9047 6.0767 8.1124 3.5051 2.3831 4.8676 1.6917 2.7498 2.1704 1.9834 2.8732 7.7682 2.4495 2.2251 4.3586 1.8159 1.4552 2.7807 2.6400 2.4980 1.8039 1.5701 1.3561 1.2828 1.3945 1.3765 1.4298 1.5259 1.4678 1.0936 1.0856 1.0836 1.0866 9.3256 11.6174 1.0642 1.0667 1.0789 1.0620 1.0613 1.0964 1.1026 1.1039 1.0985
irintensity: 0.8165 0.2640 1.1985 0.6258 1.2216 4.3115 2.1851 2.5352 3.4061 0.2902 3.4754 5.1681 2.1223 1.5781 1.3609 7.3199 1.8097 23.3634 4.6300 5.3458 14.6015 26.5911 5.3671 11.8810 18.9404 24.4980 21.3642 215.6606 49.3956 44.9163 141.7270 8.3558 20.7752 14.9387 126.8289 36.1783 15.9202 30.3061 20.7387 30.6068 5.3447 18.9320 6.5227 14.0133 3.7371 13.6740 12.3247 17.2426 7.8778 116.1960 121.1338 28.5398 4.9222 4.2114 32.4052 16.1550 35.7094 32.7053 26.6479 17.6326
temp: 298.150 k
press: 1.00000 atm
elementType: 9 9 9 8 8 6 6 6 6 6 6 6 6 1 1 1 1 1 1 1 1 1
symmnumber: 1
zpe: 419508.4 jmol-1
zpe.correction: 0.159782 hartree
zpe.thermalcorrener: 0.172295 hartree
zpe.thermalcorrenthalpy: 0.173239 hartree
zpe.thermalcorrgfe: 0.119437 hartree
zpe.sumelectzpe: -759.213990 hartree
zpe.sumelectthermal: -759.201478 hartree
zpe.sumelectthermalent: -759.200534 hartree
zpe.sumelectthermalfe: -759.254336 hartree
dipole: -5.1571 -1.7756 -2.8323
dipole: 6.1457
quadrupole: -71.9201 -78.0237 -79.1541
quadrupole: 1.1053 0.5023 -1.6376
quadrupole: 4.4459 -1.6578 -2.7881 1.1053 0.5023 -1.6376
hfenergy: -759.3737723 hartree
pointgroup: C01 [X(C8H9F3O2)]
dipole: -1.8422498 1.4839882 0.500213 debye
dipolederiv: -0.4609577 -0.0311541 0.0373866 -0.0667508 -0.3597998 0.1881961 0.1209566 0.213496 -0.6535972 -0.4747303 -0.1654766 -0.1129113 -0.1253282 -0.6736185 -0.0828495 -0.1352496 -0.1404873 -0.3600939 -0.7552454 0.2661265 0.1315071 0.269965 -0.412185 -0.1000792 0.0624722 -0.071585 -0.3247602 -0.4438068 0.1128828 0.0576833 0.0130813 -0.8907719 0.0435589 0.1056311 -0.1419881 -0.2521383 -0.5249749 0.0633091 0.0518924 0.166153 -0.2213489 -0.0463731 0.2116284 -0.003065 -0.670664 -0.7410988 -0.1023111 0.2648014 -0.1354435 -0.3293915 0.1603916 0.2119372 0.1669067 -0.0773189 0.077238 -0.0976682 0.0471194 -0.029455 0.1803335 -0.0329947 0.1293723 -0.1007498 0.114145 0.0281472 0.0227492 0.0181879 0.0389898 0.0452745 0.0469443 -0.0445091 0.0956909 0.1202924 0.1241681 -0.0429295 0.0204519 -0.0855064 0.1503598 0.030277 0.1202001 -0.0365218 0.1259154 -0.3165179 0.1734541 0.1175028 0.0503764 -0.1075982 0.0518129 0.0930253 0.024936 0.0321567 0.9311786 0.038322 -0.3352594 0.4006332 1.1622707 -0.1557551 -0.3662771 0.1301902 0.1564535 1.0124222 -0.1563466 -0.088925 -0.4210373 -0.0047189 0.1482545 -0.2336995 0.0140443 0.7815113 1.4663016 -0.004482 -0.151456 -0.0203796 1.4553952 -0.0394171 -0.1509616 0.0067324 1.1727755 0.0770229 -0.0173234 -0.0010726 0.0226479 0.0661992 -0.064301 -0.0429799 -0.0399365 -0.0352333 0.0660337 0.0141334 -0.0315452 0.0132998 0.0266817 -0.0932542 -0.0324194 -0.0417835 -0.0488229 -0.033495 -0.087137 0.0294558 -0.0774607 -0.0771 0.0542046 0.0076805 0.0481043 0.0678902 -0.0182791 0.0861694 -0.0536428 0.0789581 -0.0409898 0.0924592 -0.0617057 0.1149323 -0.0051715 0.0279972 -0.0576785 -0.0312234 -0.0376543 0.0112159 -0.0770186 0.0031302 -0.1425094 -0.1082664 0.0734207 -0.0091572 -0.0269067 -0.0412508 -0.0137506 -0.066587 -0.094086 -0.0613117 -0.0969429 -0.1516356 0.0521719 0.0801426 0.0851209 0.0329022 -0.0077239 0.0948431 -0.0001548 0.0394574 -0.0136692 -0.0530358 0.0388974 -0.0765947 -0.0652961 0.0546262 0.0330161 0.0289964 0.0742867 0.0504802 -0.0046183 -0.0620861 -0.0223642 0.0659364 -0.1043718 -0.0320053 -0.0639364 -0.0518744 unknown
polarizability: 99.4318871|-5.9792904|85.6255095|-5.9294857|-1.9962525|79.2126799 unknown
InChI: InChI=1S/C8H9F3O2/c9-8(10,11)7(13)5-3-1-2-4-6(5)12/h5H,1-4H2
charge 0 multiplicity 1
22 atoms
F  1.727186 -0.896474 1.625199
F  2.688996 1.013384 0.853936
F  3.252876 -0.995375 -0.053602
O  -0.842222 -1.995021 0.059181
O  1.259469 -0.20083 -1.796837
C  -0.288208 0.413834 0.009339
C  -1.061648 1.378511 -0.945879
C  -2.422895 1.781662 -0.339277
C  -3.295045 0.545622 -0.024714
C  -2.54699 -0.452303 0.908967
C  -1.191872 -0.820307 0.322438
C  1.03568 -0.032882 -0.584128
C  2.186038 -0.259308 0.449702
H  -0.109635 0.930834 0.974286
H  -1.204756 0.875026 -1.919717
H  -0.439016 2.272596 -1.133169
H  -2.954746 2.44663 -1.045213
H  -2.259736 2.367031 0.588664
H  -3.562137 0.027895 -0.966533
H  -4.24234 0.850117 0.456806
H  -3.127311 -1.377799 1.062159
H  -2.39009 0.028558 1.895993
