program: Gaussian 09
title: 000238406
version: EM64L-G09RevD.01
frameworkgroup: C1[X(C6H11ClF2O)]
method: RPBEPBE
basis: SDD
operation: Freq
keyword: #p
keyword: freq=noraman
keyword: PBEPBE/SDD
title: #p freq=noraman PBEPBE/SDD
converged: NO YES NO NO
title: Mulliken charges:
elementType: Cl F F O C C C C C C H H H H H H H H H H H
charge: 0.018342 -0.115501 -0.145996 -0.407737 -0.440429 -0.322978 -0.067379 -0.354747 0.014196 -0.690985 0.229208 0.220959 0.193363 0.216004 0.267760 0.197686 0.196840 0.211831 0.212680 0.219233 0.347650
chargesum: 0.00000
title: Mulliken charges with hydrogens summed into heavy atoms:
elementType: Cl F F O C C C C C C
charge: 0.018342 -0.115501 -0.145996 -0.060087 0.009738 0.086389 0.200381 0.039779 0.014196 -0.047241
polarizability: 8.77717006e+01 2.90987855e+00 8.28224482e+01 1.39022824e+00 2.55976626e+00 6.57039150e+01
1716.lowfreq: -13.5755 -9.2549 -0.0026 -0.0020 -0.0018 6.5764 42.9344 49.2441 72.6549
frequency: 42.6595 49.1677 72.6235 104.7562 119.7022 179.7742 219.8813 227.8316 266.1033 298.3291 307.7560 346.0625 365.2628 380.0355 426.1162 523.0754 550.4323 734.6954 743.3978 787.3276 862.0406 881.0989 897.8780 950.2955 989.5535 1029.5978 1065.9776 1083.3032 1091.1527 1118.5260 1152.6423 1199.0163 1251.3677 1259.5049 1288.3585 1304.4768 1306.0759 1345.8057 1359.6964 1373.0787 1390.5312 1460.5437 1469.6204 1477.0461 1478.6238 1489.0883 2964.8369 2971.5931 2975.8836 2982.7586 3007.7787 3032.5262 3055.6095 3072.0290 3074.9915 3076.8693 3539.6715
redmass: 2.3060 3.9941 3.4753 3.0381 2.5832 4.5814 3.8579 1.1987 7.4955 4.1356 4.1537 1.7470 5.5452 5.2151 3.2173 4.7253 4.6649 1.1485 4.0661 1.3082 7.2557 2.0941 1.8693 1.5882 5.7760 3.3876 2.5941 2.2072 1.7716 2.6632 4.4176 1.5601 1.2943 1.3191 1.1070 1.2197 1.2832 1.4434 1.5506 1.1961 1.2159 1.0798 1.0646 1.0425 1.0676 1.0869 1.0595 1.0623 1.0366 1.0615 1.0978 1.0990 1.0991 1.0984 1.0905 1.0993 1.0658
irintensity: 0.7359 0.1324 0.6396 1.8103 0.1101 1.6100 6.8116 0.6679 1.0709 2.6999 16.4649 109.6780 10.8363 23.0252 6.2770 42.7832 11.9961 14.3225 43.4716 3.7516 231.3012 14.4972 21.4286 15.1445 113.1584 13.9771 68.4757 12.3066 43.4541 22.8814 77.0460 9.2849 12.3898 23.0166 0.6018 8.1963 8.3748 3.2222 0.8872 16.0464 12.7631 3.1388 0.9313 12.9822 2.8815 20.9405 9.3234 18.0691 33.7644 53.9023 5.0288 6.7304 15.4471 49.1319 55.7386 46.9679 14.9683
temp: 298.150 k
press: 1.00000 atm
elementType: 17 9 9 8 6 6 6 6 6 6 1 1 1 1 1 1 1 1 1 1 1
symmnumber: 1
zpe: 431100.9 jmol-1
zpe.correction: 0.164198 hartree
zpe.thermalcorrener: 0.176421 hartree
zpe.thermalcorrenthalpy: 0.177365 hartree
zpe.thermalcorrgfe: 0.124601 hartree
zpe.sumelectzpe: -969.374612 hartree
zpe.sumelectthermal: -969.362389 hartree
zpe.sumelectthermalent: -969.361445 hartree
zpe.sumelectthermalfe: -969.414208 hartree
dipole: 2.9710 -0.7318 0.6398
dipole: 3.1260
quadrupole: -72.6264 -69.4982 -66.7400
quadrupole: 0.7757 0.7771 4.4411
quadrupole: -3.0049 0.1234 2.8815 0.7757 0.7771 4.4411
hfenergy: -969.5388099 hartree
pointgroup: C01 [X(C6H11Cl1F2O1)]
dipole: -1.1837586 -0.2475644 -0.2234956 debye
dipolederiv: -0.2415635 0.1257878 -0.0427231 0.0975187 -0.713139 0.2246932 -0.0232384 0.2060949 -0.2389104 -0.7762306 -0.2940102 -0.1639817 -0.2189572 -0.5433342 -0.0761614 -0.112767 -0.1202645 -0.3164045 -0.4053401 0.0458255 0.1050682 0.0398875 -0.3308575 0.0114874 0.0389743 0.0710957 -0.8516913 -0.7178304 0.0369094 -0.0265911 -0.0111316 -0.7372231 0.1950724 0.0000852 0.208693 -0.1721643 -0.1343957 -0.0220296 -0.0225156 0.0091177 -0.0496597 -0.0093996 -0.0406311 -0.0735875 0.10937 -0.0061658 -0.0035841 -0.0189159 -0.0743309 0.0830635 -0.0539825 -0.0474032 -0.0507707 0.1336557 0.307305 -0.1209936 0.089861 0.1142845 0.4763226 -0.1305684 0.0280629 -0.0700397 0.177398 0.0322878 0.0102193 0.0107936 0.0446025 0.1373688 -0.0329572 0.0393442 -0.0373475 0.1433363 1.2202097 0.2112819 0.0394372 -0.067744 1.5192414 -0.1459948 0.1235555 -0.2100473 1.3251722 -0.0727698 0.0222333 0.0198211 -0.0051267 0.072173 -0.0201026 -0.0035793 -0.0181523 0.0772293 0.093125 -0.0029406 0.0003267 0.0240572 -0.1015312 0.0384739 -0.0001846 0.0579046 0.0704919 0.049906 -0.0228337 0.0250251 -0.0033548 0.0786132 0.0241445 0.0310675 -0.0048634 -0.1369415 0.033052 0.0000284 -0.001016 0.0018327 0.0678013 0.0158996 0.0068532 -0.0080649 -0.1830033 0.0714091 0.0112095 -0.0056628 0.0350381 -0.1301648 0.0258717 -0.0050847 0.0491593 0.0582194 0.0841107 0.0134274 0.0193007 0.0143836 0.0371305 -0.0046243 -0.0196329 0.0203122 -0.0612019 0.0257707 -0.0029677 0.0492084 -0.0094968 0.0700059 0.0221939 0.0192639 -0.0097037 -0.1991864 0.0219144 0.0506511 -0.0099587 0.0163313 -0.1894025 0.0234835 -0.0109128 0.0562746 0.0649204 0.0745931 0.0143113 -0.0050331 0.0181044 0.0844378 0.0277694 0.0621952 0.0151031 -0.1795781 0.0744924 -0.0014481 0.0150496 0.06617 -0.1666859 0.0483139 0.0094137 0.0610192 0.0741855 -0.1436515 -0.0814604 -0.0711518 -0.110104 0.0340236 -0.0586777 -0.0945792 -0.0585993 0.0509278 0.4097714 0.0103831 -0.0063419 0.0189177 0.3018165 -0.1249347 -0.0008024 -0.0842159 0.0541749 unknown
polarizability: 87.2256127|-2.8073287|81.3279982|2.2156929|-6.2006607|67.744453 unknown
InChI: InChI=1S/C6H11ClF2O/c1-2-3-4-5(10)6(7,8)9/h5,10H,2-4H2,1H3
charge 0 multiplicity 1
21 atoms
Cl 2.163641 -1.892544 0.757907
F  3.012794 0.616641 0.550536
F  2.142709 -0.245764 -1.357235
O  0.563944 1.834146 -0.090745
C  -0.602875 -0.372504 -0.183957
C  -1.962771 0.18424 0.292214
C  0.575305 0.446454 0.380613
C  -3.159858 -0.557367 -0.343365
C  1.953912 -0.167311 0.055554
C  -4.51984 -0.013028 0.143714
H  -0.506237 -1.428784 0.129932
H  -0.551991 -0.363002 -1.292246
H  -2.026289 0.101245 1.397059
H  -2.024554 1.264408 0.055904
H  0.506187 0.531407 1.478844
H  -3.100037 -0.470076 -1.44752
H  -3.088863 -1.639897 -0.112528
H  -4.619207 -0.116866 1.240548
H  -4.628794 1.059832 -0.102435
H  -5.361954 -0.554493 -0.324187
H  0.567378 1.837266 -1.083706
