program: Gaussian 09
title: 000238404
version: EM64L-G09RevD.01
frameworkgroup: C1[X(C6H8Cl2F4O)]
method: RPBEPBE
basis: SDD
operation: Freq
keyword: #p
keyword: freq=noraman
keyword: PBEPBE/SDD
title: #p freq=noraman PBEPBE/SDD
converged: YES YES NO NO
title: Mulliken charges:
elementType: Cl Cl F F F F O C C C C C C H H H H H H H H
charge: 0.061720 0.043215 -0.127690 -0.109447 -0.109043 -0.118597 -0.403222 0.233343 -0.398322 -0.359577 0.005011 0.004833 -0.694445 0.238010 0.254433 0.242202 0.218119 0.226226 0.211443 0.214984 0.366805
chargesum: 0.00000
title: Mulliken charges with hydrogens summed into heavy atoms:
elementType: Cl Cl F F F F O C C C C C C
charge: 0.061720 0.043215 -0.127690 -0.109447 -0.109043 -0.118597 -0.036418 0.233343 0.094121 0.100744 0.005011 0.004833 -0.041793
polarizability: 1.05205791e+02 -3.53690441e+00 7.81323056e+01 -1.08192976e+01 -5.32461255e+00 8.46895027e+01
1716.lowfreq: -7.4122 -0.0032 -0.0027 -0.0009 2.6754 10.9506 44.1920 58.1302 94.7100
frequency: 44.0521 58.1067 94.6975 105.1212 116.5008 154.6186 191.9066 211.5071 235.1283 245.6935 273.5806 289.6978 296.4633 302.5040 330.1608 356.9186 373.1279 379.1592 389.4415 404.2744 454.4773 551.2641 573.9872 644.5891 743.6021 755.0627 847.2134 859.2312 915.9216 932.2292 958.5462 995.1685 1022.9123 1052.0604 1060.2918 1071.9163 1094.3482 1142.4508 1161.7109 1259.5896 1300.6073 1315.4811 1320.9884 1364.4807 1395.0206 1450.3858 1475.4671 1479.0873 1486.1196 2976.9537 3011.8825 3021.0305 3055.4833 3076.6820 3081.7119 3097.5065 3498.5365
redmass: 19.9672 5.5103 3.6337 2.0626 4.7052 13.5756 5.5429 7.4205 1.2520 10.2151 7.9708 9.1585 4.5415 4.9659 5.8925 5.5816 17.5870 13.4744 4.8344 1.4111 7.1556 9.4790 13.8797 4.7609 2.2539 1.8086 4.6901 1.8000 1.9874 6.8571 3.6847 7.2753 3.4982 4.1914 4.9567 5.4414 3.0897 3.8082 2.2724 1.2806 1.3195 1.3931 1.1412 1.3902 1.2083 1.0787 1.0492 1.0414 1.0827 1.0360 1.0607 1.0604 1.0991 1.1013 1.0987 1.1039 1.0655
irintensity: 0.2801 0.0211 0.0774 0.1165 0.0625 0.8503 0.8919 0.9905 0.4849 5.8101 2.2660 1.4291 3.4582 1.7411 10.1777 22.8011 2.5951 2.2558 16.5150 133.9452 23.4313 14.9657 4.0386 26.6750 81.5404 113.8857 68.4393 14.4619 5.1303 159.3894 37.0900 188.2091 45.2637 47.3995 144.0213 120.6192 39.4130 21.7888 8.9999 2.3009 41.1616 31.6602 3.5395 4.0802 9.1452 9.9329 3.0402 13.9846 16.9192 32.4782 5.1272 16.3209 7.0034 12.8249 38.9892 36.8924 27.5609
temp: 298.150 k
press: 1.00000 atm
elementType: 17 17 9 9 9 9 8 6 6 6 6 6 6 1 1 1 1 1 1 1 1
symmnumber: 1
zpe: 361013.0 jmol-1
zpe.correction: 0.137503 hartree
zpe.thermalcorrener: 0.152212 hartree
zpe.thermalcorrenthalpy: 0.153156 hartree
zpe.thermalcorrgfe: 0.095657 hartree
zpe.sumelectzpe: -1627.089566 hartree
zpe.sumelectthermal: -1627.074857 hartree
zpe.sumelectthermalent: -1627.073912 hartree
zpe.sumelectthermalfe: -1627.131412 hartree
dipole: 1.1431 -0.9223 0.3357
dipole: 1.5067
quadrupole: -87.1563 -93.9107 -89.1985
quadrupole: -1.7147 -5.2290 -0.8148
quadrupole: 2.9322 -3.8222 0.8900 -1.7147 -5.2290 -0.8148
hfenergy: -1627.2270684 hartree
pointgroup: C01 [X(C6H8Cl2F4O1)]
dipole: 0.5166219 -0.2382647 0.1664583 debye
dipolederiv: -0.1496009 -0.0033981 0.1141473 -0.0200413 -0.2025699 0.1978342 0.1094599 0.1230616 -0.6270571 -0.6475283 0.0261828 0.2468086 -0.0297604 -0.1365092 -0.0390676 0.2619802 -0.0664876 -0.3157354 -0.752855 0.1234902 0.1768387 0.2275036 -0.4375565 -0.0263872 0.1421682 0.0017485 -0.3372294 -0.473371 -0.088596 -0.1999599 -0.2313845 -0.4766406 -0.1776701 -0.2022204 -0.1014445 -0.5090213 -0.3630319 -0.006326 -0.1284504 -0.0590669 -0.3116079 0.0793426 -0.0521332 0.124125 -0.7896444 -0.4414539 0.0314091 0.0498297 0.1775439 -0.8121989 -0.0288039 0.0187425 -0.0618922 -0.2477781 -0.3107857 -0.1500988 0.0269715 -0.1775657 -0.5266404 0.0842851 0.0347085 0.0521765 -0.7590586 0.0535688 -0.0228288 -0.015269 0.1645559 0.2633159 -0.2271781 0.0838541 0.0539644 0.3732982 -0.0293298 -0.0313029 0.04295 -0.1271522 -0.030003 -0.0137571 -0.1097674 0.0074616 0.0746063 0.0792364 0.0108497 0.0008859 0.1390625 0.085943 -0.053753 0.0878986 -0.041936 0.0903283 1.2710802 -0.0080283 -0.0981457 0.0172536 1.0141826 0.1105367 -0.052947 -0.1379748 1.4334308 1.4101057 -0.0299385 -0.2549813 -0.1469611 1.1759442 0.0070124 -0.2728938 -0.0195658 1.2545124 -0.0660691 0.0353544 0.0199317 -0.0291286 0.0604368 -0.0131754 -0.0276815 -0.0178132 0.0987535 0.0546846 0.0009779 -0.0248188 -0.0069436 0.1023747 0.0061752 -0.0424332 -0.0290839 -0.0782345 0.0763497 0.023136 0.0039651 -0.0086781 -0.0553557 0.0469456 0.0115339 0.0523546 0.0768223 0.0630734 0.0028778 0.0240322 -0.001387 0.0718534 -0.0348402 -0.0142435 -0.0477478 -0.0944417 0.0483037 0.007319 -0.0031851 -0.0190637 -0.1143077 0.0631369 0.0036489 0.0900697 0.0375791 -0.1675322 -0.0624766 -0.0395618 -0.0853014 0.045893 -0.0349068 -0.0522352 -0.0323523 0.0832819 0.0829898 0.0105498 -0.0328981 0.0294899 0.0709086 -0.0262167 0.0358889 -0.0536335 -0.168518 0.0819096 -0.0308815 0.0279112 0.0387 -0.1314425 0.0871544 0.0106538 0.1049451 0.0380413 0.1802558 0.161729 0.0629982 0.1483253 0.3439802 -0.0066671 0.0260176 0.0000246 0.3660643 unknown
polarizability: 103.9017125|-2.3601|74.461863|-11.0143618|-3.7094298|89.6640235 unknown
InChI: InChI=1S/C6H8Cl2F4O/c1-2-3-4(13,5(7,9)10)6(8,11)12/h13H,2-3H2,1H3
charge 0 multiplicity 1
21 atoms
Cl 0.199003 1.785979 -1.824962
Cl -2.840228 -0.741424 0.86992
F  -1.474349 1.860805 0.242055
F  0.702334 2.126072 0.751824
F  -1.651307 -0.61817 -1.523004
F  -1.038107 -2.344697 -0.202838
O  0.028906 -0.280977 1.763673
C  -0.054808 -0.159935 0.323066
C  1.235841 -0.813478 -0.238786
C  2.556612 -0.124818 0.176523
C  -0.17286 1.36798 -0.053264
C  -1.31395 -0.961028 -0.197617
C  3.765044 -0.987693 -0.247207
H  1.164149 -0.872869 -1.340456
H  1.239544 -1.8460 0.15119
H  2.560834 0.023912 1.270605
H  2.642384 0.873924 -0.288178
H  4.713755 -0.49897 0.037875
H  3.783685 -1.145399 -1.342175
H  3.738126 -1.981512 0.237593
H  -0.804009 0.052596 2.195064
