program: Gaussian 09
title: 000238399
version: EM64L-G09RevD.01
frameworkgroup: C1[X(C5H9ClF2O)]
method: RPBEPBE
basis: SDD
operation: Freq
keyword: #p
keyword: freq=noraman
keyword: PBEPBE/SDD
title: #p freq=noraman PBEPBE/SDD
converged: NO YES NO NO
title: Mulliken charges:
elementType: Cl F F O C C C C C H H H H H H H H H
charge: 0.018460 -0.115894 -0.146637 -0.408395 -0.408835 -0.065609 -0.328075 0.020513 -0.690575 0.216315 0.226282 0.263321 0.222435 0.200446 0.224335 0.212078 0.211878 0.347957
chargesum: 0.00000
title: Mulliken charges with hydrogens summed into heavy atoms:
elementType: Cl F F O C C C C C
charge: 0.018460 -0.115894 -0.146637 -0.060438 0.033762 0.197713 0.094806 0.020513 -0.042284
polarizability: 7.24285163e+01 2.97535399e+00 7.40493280e+01 1.93266700e+00 2.70902395e+00 5.67892754e+01
1716.lowfreq: -9.3093 0.0029 0.0036 0.0040 6.8637 11.2537 56.5449 81.4783 87.2405
frequency: 56.2927 81.4219 87.2127 130.0262 198.2287 237.3024 251.9565 285.4277 303.1672 332.7169 358.8950 370.4466 395.7923 528.2729 543.3672 742.9008 752.9447 842.9817 865.5498 894.6010 934.0656 998.9677 1041.1524 1074.6049 1093.6566 1118.4970 1152.9121 1210.0382 1270.6188 1274.4724 1307.1770 1327.2680 1358.3675 1374.7363 1393.7885 1463.6375 1476.5136 1478.7362 1488.3111 2975.9992 2978.3319 2987.7405 3031.0971 3053.6626 3072.8558 3077.8489 3079.5092 3539.1002
redmass: 4.0115 2.6024 2.6305 3.8657 4.8466 1.1549 4.9057 6.7730 3.7410 4.6449 1.4595 9.8767 4.7578 5.7888 3.8024 2.3455 1.5944 1.7474 7.0968 1.8675 2.0596 4.3196 3.7216 1.7199 2.1432 2.7396 4.4065 1.4671 1.2629 1.2799 1.1601 1.3772 1.5024 1.1922 1.2139 1.0808 1.0476 1.0429 1.0865 1.0391 1.0602 1.0613 1.0964 1.0983 1.0928 1.0961 1.0991 1.0659
irintensity: 0.2586 1.2751 0.4631 1.5789 0.7168 0.0287 12.8187 10.4657 7.9142 9.5893 115.6387 4.1054 14.9854 34.1754 15.5283 39.2318 24.2791 17.7999 235.2702 12.6981 12.1319 119.5561 53.8046 41.7689 32.2934 28.1909 76.7874 10.0178 20.6443 15.3818 6.7617 4.1968 5.3794 15.3910 11.6135 3.4288 3.5917 13.6594 17.3837 29.3769 1.7438 43.5971 0.3947 1.8596 11.1940 72.9593 46.7752 15.1536
temp: 298.150 k
press: 1.00000 atm
elementType: 17 9 9 8 6 6 6 6 6 1 1 1 1 1 1 1 1 1
symmnumber: 1
zpe: 358240.7 jmol-1
zpe.correction: 0.136447 hartree
zpe.thermalcorrener: 0.147194 hartree
zpe.thermalcorrenthalpy: 0.148138 hartree
zpe.thermalcorrgfe: 0.099499 hartree
zpe.sumelectzpe: -930.151343 hartree
zpe.sumelectthermal: -930.140596 hartree
zpe.sumelectthermalent: -930.139652 hartree
zpe.sumelectthermalfe: -930.188291 hartree
dipole: 2.8921 -0.8139 0.4887
dipole: 3.0439
quadrupole: -63.4159 -63.2323 -60.1992
quadrupole: 0.7530 0.9557 4.2958
quadrupole: -1.1334 -0.9499 2.0833 0.7530 0.9557 4.2958
hfenergy: -930.2877899 hartree
pointgroup: C01 [X(C5H9Cl1F2O1)]
dipole: -1.1598947 0.2378992 0.1794542 debye
dipolederiv: -0.2402364 -0.1339119 0.0420021 -0.1026882 -0.7198216 0.2154445 0.0208791 0.1952528 -0.2312787 -0.7672657 0.2989447 0.1568516 0.2178617 -0.544157 -0.0741868 0.1003122 -0.1156371 -0.3122417 -0.3956056 -0.0455958 -0.091093 -0.0382552 -0.3329759 0.0186682 -0.0244054 0.0783021 -0.8565551 -0.7073141 -0.0443335 0.012754 -0.0018817 -0.7471971 0.1876031 -0.0129271 0.2015138 -0.1673174 -0.129856 0.0280332 0.0192119 -0.026767 -0.0604647 -0.0193692 0.0192188 -0.079593 0.1031789 0.3070638 0.130357 -0.0822222 -0.0950242 0.4860364 -0.1296567 -0.0201399 -0.0657026 0.1744727 0.0749545 0.0056602 0.0180031 0.0766802 0.091 -0.0383937 0.0479376 -0.0370482 0.1397522 1.2087759 -0.2062634 -0.048727 0.0647734 1.5272044 -0.1420703 -0.125935 -0.2129954 1.3177082 -0.0583761 0.0329351 0.0235901 0.0100237 0.0696166 -0.02383 0.0031169 -0.0265622 0.0731554 0.0482734 0.0204187 -0.0246589 0.0036744 0.0792436 0.0264409 -0.0223612 -0.0032712 -0.1409383 0.0896998 -0.004113 -0.0008217 -0.0234072 -0.1042501 0.0366873 0.0001208 0.0567016 0.0730515 0.0825009 -0.014946 -0.0139496 -0.0131359 0.0360518 -0.0032896 0.0240682 0.0212878 -0.0624155 0.063211 0.01227 0.0017332 -0.0341168 -0.1362985 0.0234044 0.0057789 0.0497522 0.0679343 0.0249066 0.001537 0.0351838 -0.0008081 0.076222 0.0154753 0.0014988 -0.010455 -0.1898242 -0.1672821 -0.0553906 -0.0595656 -0.0787361 0.0632502 -0.0405541 -0.0815556 -0.0377011 0.0670893 0.0832874 0.0175204 -0.0249802 0.0213177 0.078385 0.0303203 0.0379624 0.0080211 -0.1801913 0.0790514 -0.0357222 0.0234145 0.0311772 -0.1688806 0.0390093 0.0190903 0.0595332 0.0726069 0.4042112 -0.0073998 0.0132738 -0.010688 0.3070354 -0.1217031 0.0073403 -0.0813987 0.051813 unknown
polarizability: 71.7282121|2.2196994|72.8519188|-2.5012604|-6.1318985|58.6869887 unknown
InChI: InChI=1S/C5H9ClF2O/c1-2-3-4(9)5(6,7)8/h4,9H,2-3H2,1H3
charge 0 multiplicity 1
18 atoms
Cl 1.684568 1.891798 -0.685412
F  2.518478 -0.623492 -0.490517
F  1.594463 0.21374 1.403021
O  0.046707 -1.840476 0.061097
C  -1.114618 0.370139 0.146427
C  0.077728 -0.446872 -0.391199
C  -2.461361 -0.180539 -0.37466
C  1.448002 0.157271 -0.015885
C  -3.667902 0.567098 0.229836
H  -1.097685 0.351411 1.255543
H  -1.008146 1.428924 -0.155512
H  0.042466 -0.517198 -1.49207
H  -2.529552 -1.260679 -0.145034
H  -2.485711 -0.093653 -1.47969
H  -4.620134 0.166991 -0.162249
H  -3.688627 0.466256 1.331274
H  -3.631868 1.646923 -0.007646
H  0.024191 -1.85724 1.05368
