program: Gaussian 09
title: 000238392
version: EM64L-G09RevD.01
frameworkgroup: C1[X(C4H6F4O)]
method: RPBEPBE
basis: SDD
operation: Freq
keyword: #pfreq=noraman
keyword: PBEPBE/SDD
title: #p freq=noraman PBEPBE/SDD
converged: NO YES NO NO
title: Mulliken charges:
elementType: F F F F O C C C C H H H H H H
charge: -0.187184 -0.176934 -0.187185 -0.176939 -0.421225 0.172983 0.087538 0.087504 -0.705919 0.197072 0.197089 0.201912 0.271085 0.271019 0.369183
chargesum: 0.00000
title: Mulliken charges with hydrogens summed into heavy atoms:
elementType: F F F F O C C C C
charge: -0.187184 -0.176934 -0.187185 -0.176939 -0.052042 0.172983 0.284610 0.284593 0.038098
polarizability: 4.75683057e+01 1.15770369e-03 5.21002135e+01 1.56289707e-03 -2.05646027e+00 4.51410210e+01
1716.lowfreq: -24.8536 -18.5615 -0.0014 -0.0012 0.0003 9.9906 27.3003 80.6394 162.6481
frequency: 25.7687 80.6295 162.6396 165.7109 236.5334 245.1043 279.5245 318.0703 337.2512 365.7788 383.0362 473.4104 504.7367 564.5838 712.2143 809.7808 854.3185 930.0776 948.8165 991.0118 1012.6513 1044.5364 1072.8168 1159.9935 1195.9270 1284.6556 1288.4107 1324.2230 1327.8003 1355.3922 1399.4176 1461.9348 1474.3631 3012.5596 3041.0680 3053.2729 3114.8837 3144.6770 3535.3902
redmass: 9.8935 8.8117 1.1397 9.6107 3.0243 6.2717 5.5589 11.9099 5.3848 3.2782 1.2353 8.3721 8.8630 5.1538 5.3215 5.5347 2.5805 2.0490 8.3978 5.1795 3.6348 5.2113 2.6590 1.8714 3.4626 1.1636 1.2035 1.2705 1.4319 1.5740 1.2019 1.0573 1.0498 1.0387 1.0869 1.0881 1.0962 1.1017 1.0653
irintensity: 0.0213 1.7074 3.1208 2.5443 7.7379 17.0280 0.4309 1.6416 3.6403 2.1185 148.8268 30.8638 9.7854 16.0602 58.2036 38.5223 0.7572 3.3610 54.8816 256.7697 127.2325 6.5097 66.3836 0.9834 16.1049 2.2299 52.0027 22.3627 17.2031 10.9168 24.2021 16.1214 13.4327 8.1286 2.1819 66.3185 13.6236 2.5477 23.4359
temp: 298.150 k
press: 1.00000 atm
elementType: 9 9 9 9 8 6 6 6 6 1 1 1 1 1 1
symmnumber: 1
zpe: 267323.3 jmol-1
zpe.correction: 0.101818 hartree
zpe.thermalcorrener: 0.111664 hartree
zpe.thermalcorrenthalpy: 0.112608 hartree
zpe.thermalcorrgfe: 0.065963 hartree
zpe.sumelectzpe: -629.876254 hartree
zpe.sumelectthermal: -629.866409 hartree
zpe.sumelectthermalent: -629.865464 hartree
zpe.sumelectthermalfe: -629.912109 hartree
dipole: -0.0003 0.8575 -3.1515
dipole: 3.2660
quadrupole: -61.0906 -52.3255 -46.6156
quadrupole: 0.0029 -0.0032 -2.4765
quadrupole: -7.7467 1.0184 6.7283 0.0029 -0.0032 -2.4765
hfenergy: -629.9780722 hartree
pointgroup: C01 [X(C4H6F4O1)]
dipole: -0.0019998 -0.2011519 1.269116 debye
dipolederiv: -0.3653167 -0.149765 0.0161261 -0.0599641 -0.7416696 0.1206105 -0.0045043 0.2079514 -0.3277668 -0.7165685 0.2164199 0.0078495 0.1442005 -0.4375821 0.0039114 0.0688628 -0.0458855 -0.2485406 -0.3661877 0.1507431 -0.0168897 0.0611441 -0.7402438 0.1212012 0.0034702 0.2089309 -0.3282292 -0.7148153 -0.2174445 -0.0090961 -0.1455128 -0.4392023 0.003618 -0.0699692 -0.0466754 -0.2487505 -0.6186634 -0.0010921 0.0000092 -0.0012023 -0.2027227 0.0947914 0.0000315 0.067359 -0.7512239 0.1631833 0.0003439 -0.0004117 0.000383 0.1084422 -0.0582611 -0.0003131 -0.127896 0.5439276 1.0495306 -0.0573305 -0.0263352 -0.0626416 1.1195946 -0.1184138 0.0040457 -0.0768887 0.5925819 1.0490033 0.057288 0.0281873 0.0628976 1.1197844 -0.1185895 -0.0022966 -0.0771625 0.5928464 -0.0621917 0.0000568 -0.0003483 -0.0000967 -0.0965997 0.0496621 -0.0002448 -0.0483831 0.0382839 0.0087909 -0.0010592 -0.0107774 0.0038855 0.01105 -0.0410438 0.0342915 -0.0170047 -0.1375234 0.0089071 0.0010883 0.011419 -0.0038218 0.0110143 -0.0411844 -0.033742 -0.017319 -0.1374878 0.1191502 0.0000213 0.0007014 0.0001572 0.0867825 -0.0282478 0.000588 0.0237313 -0.1371757 0.0110096 -0.0786658 -0.0550971 -0.0623648 0.0631307 -0.0018913 -0.0529847 -0.0200965 0.0987576 0.0098275 0.0785933 0.05461 0.0621651 0.0637826 -0.0013376 0.0526337 -0.0194981 0.099299 0.424341 0.0008024 0.000053 0.000771 0.0744388 0.0151747 0.0001312 -0.011163 0.3510015 unknown
polarizability: 47.5683065|-0.0045419|51.5759684|0.0076266|-2.7572525|45.6652652 unknown
InChI: InChI=1S/C4H6F4O/c1-4(9,2(5)6)3(7)8/h2-3,9H,1H3
charge 0 multiplicity 1
15 atoms
F  1.418168 1.519273 -0.124717
F  2.43614 -0.495845 0.25864
F  -1.423874 1.512917 -0.131621
F  -2.434419 -0.506014 0.251036
O  0.004053 -0.461618 -1.468441
C  0.001274 -0.471048 -0.016945
C  1.258102 0.257762 0.53971
C  -1.260481 0.252954 0.534879
C  0.003457 -1.943791 0.419469
H  1.242572 0.451726 1.628771
H  -1.249276 0.448348 1.623731
H  0.000787 -2.048205 1.51953
H  -0.890856 -2.437576 0.011429
H  0.902087 -2.43353 0.016064
H  0.002268 0.478447 -1.790732
