program: Gaussian 09
title: 000238387
version: EM64L-G09RevD.01
frameworkgroup: C1[X(C18H25NO2)]
method: RPBEPBE
basis: SDD
operation: Freq
keyword: #p
keyword: freq=noraman
keyword: PBEPBE/SDD
title: #p freq=noraman PBEPBE/SDD
converged: YES YES NO NO
title: Mulliken charges:
elementType: O O N C C C C C C C C C C C C C C C C C C H H H H H H H H H H H H H H H H H H H H H H H H H
charge: -0.448994 -0.423800 -0.721405 0.403895 -0.153454 -0.106672 -0.172050 -0.194846 -0.521249 -0.558157 -0.479863 -0.457160 -0.507992 -0.818823 0.287327 -0.583711 0.334447 -0.488216 -0.559612 0.058620 0.167443 0.215138 0.241329 0.199514 0.201385 0.190491 0.225846 0.209972 0.231320 0.224065 0.187615 0.226847 0.198961 0.219425 0.214325 0.254513 0.216187 0.222544 0.221656 0.227659 0.336342 0.233333 0.253834 0.306693 0.307371 0.377905
chargesum: 0.00000
title: Mulliken charges with hydrogens summed into heavy atoms:
elementType: O O N C C C C C C C C C C C C C C C C C C
charge: -0.112652 -0.045895 -0.107340 0.403895 0.061684 0.134657 0.027463 0.006538 -0.104911 -0.116865 -0.068183 -0.031351 -0.074242 -0.125579 0.287327 -0.134395 0.334447 -0.254883 -0.305778 0.058620 0.167443
polarizability: 2.68351993e+02 -7.08147910e+00 2.00086287e+02 6.92129758e+00 4.58865730e+00 1.35456208e+02
1716.lowfreq: -17.5290 -6.8579 -0.0005 -0.0004 0.0004 1.3169 27.6046 50.9514 94.2719
frequency: 27.2819 50.9310 94.2478 110.1442 123.0811 140.5227 160.1063 174.3435 206.1100 211.4470 225.5726 235.5195 244.5169 262.3648 272.9777 289.6352 293.4111 302.5569 351.3990 357.5604 380.6045 400.5129 418.1025 441.1305 448.8092 461.3977 486.0702 520.6791 540.0918 551.3568 587.7589 603.2926 640.0984 648.9289 704.6081 712.2635 722.7244 725.0766 762.8694 800.4672 819.3487 824.7021 832.4890 849.1393 852.4193 877.5532 885.8820 902.4051 920.8150 944.1597 957.5402 981.8474 983.8139 1002.8000 1021.9553 1025.0917 1038.3447 1056.4129 1073.0166 1084.8598 1099.0479 1120.3833 1125.8616 1140.2588 1142.1722 1149.5020 1164.8814 1172.3223 1176.2251 1186.6457 1196.3778 1213.6912 1215.3225 1231.6130 1236.4732 1244.2736 1253.1860 1262.0741 1271.0980 1283.0254 1286.3894 1303.3290 1308.9455 1313.6625 1317.2223 1325.2076 1333.4973 1335.2455 1341.8049 1353.0810 1370.9936 1382.1190 1390.4285 1393.7005 1428.5472 1458.4079 1459.0373 1466.7822 1470.4093 1471.1015 1478.2130 1488.9885 1491.1467 1498.3503 1579.7780 1629.8969 1636.9956 2891.4930 2905.0321 2926.2095 2956.1137 2956.6917 2958.7337 2970.8352 2982.8909 2990.9965 2996.5757 3005.5594 3019.1674 3027.4993 3034.1902 3039.6024 3044.6824 3068.5426 3084.8459 3096.1589 3134.3995 3142.8469 3200.4341 3447.6726 3559.5220 3572.8890
redmass: 3.8574 4.2858 3.3015 4.3543 2.3100 2.3830 1.4670 1.7613 1.8513 2.9096 2.0799 2.6111 1.3049 2.8032 2.6903 3.6584 3.2295 3.2816 3.2233 2.4820 3.2996 4.0492 3.4700 2.8237 4.0814 4.0246 2.4649 3.2112 3.5261 4.1711 2.9551 2.6697 4.6434 3.8121 2.5670 2.8588 2.1274 1.9535 4.0709 2.8836 1.0745 1.8714 1.5825 1.8552 2.4775 1.5253 1.5283 1.8811 1.9747 2.2261 1.8682 2.3629 2.6340 2.0578 2.3400 1.7107 2.9556 2.6382 2.8217 1.8086 2.9996 2.1333 1.6054 1.9311 1.3248 2.0580 1.4466 1.3903 1.9047 1.3492 1.8837 1.2010 1.6745 1.6032 1.4167 1.4012 1.4422 1.5777 1.5711 1.3853 1.3368 1.3847 2.2060 1.6706 1.4919 1.6339 1.6376 1.3602 1.4823 1.5631 1.5443 1.3127 3.5973 1.3591 3.9836 1.0791 1.1250 1.0827 1.0818 1.0922 1.0851 1.0674 1.0712 3.5084 3.6583 2.8416 1.7116 1.0804 1.0799 1.0841 1.0644 1.0657 1.0740 1.0702 1.0603 1.0592 1.0371 1.0619 1.0933 1.0960 1.1013 1.1020 1.1029 1.1042 1.0977 1.0990 1.0899 1.0917 1.0616 1.0447 1.0977 1.0662
irintensity: 0.5140 3.3430 1.7387 2.0592 1.4015 0.9979 11.7628 0.9449 9.6480 13.4857 1.1567 8.1489 102.6780 0.3440 6.0979 6.3259 9.2465 5.1866 6.5341 5.0585 2.4773 3.2119 1.6688 7.7591 6.3051 1.7024 0.9215 3.7250 0.2544 1.7146 9.8163 2.5466 0.6429 11.2278 40.0502 3.1986 55.6403 83.3071 1.5300 14.7415 136.6876 8.0732 8.9011 3.8499 14.8417 3.0800 31.5420 7.0162 2.7221 28.8007 7.9652 70.1974 0.3587 16.7421 9.8544 3.2296 18.3470 5.4106 1.1558 6.1299 12.2760 8.7712 4.7786 1.8927 0.7602 3.2720 16.5855 39.3099 0.2419 4.4147 2.0384 0.7575 17.3016 59.9864 48.1514 6.2971 3.4016 37.0460 69.1870 6.4948 6.4828 0.2410 27.2072 7.3015 1.9376 4.0708 3.4258 1.4066 0.9106 5.4752 3.9790 11.0073 40.5787 12.5501 0.5574 7.6959 6.9985 8.8860 10.3464 7.3203 2.2225 7.7349 8.2069 173.9000 21.1514 18.0068 36.1115 14.2882 9.2650 56.8548 46.0822 22.3568 11.9823 54.6820 31.9579 31.8081 23.3817 47.2876 40.4716 32.6665 42.4139 68.7717 5.8143 72.4796 30.5693 21.8190 14.4958 5.5318 152.6329 0.8742 10.7799 3.1065
temp: 298.150 k
press: 1.00000 atm
elementType: 8 8 7 6 6 6 6 6 6 6 6 6 6 6 6 6 6 6 6 6 6 1 1 1 1 1 1 1 1 1 1 1 1 1 1 1 1 1 1 1 1 1 1 1 1 1
symmnumber: 1
zpe: 1039773.0 jmol-1
zpe.correction: 0.396029 hartree
zpe.thermalcorrener: 0.415393 hartree
zpe.thermalcorrenthalpy: 0.416337 hartree
zpe.thermalcorrgfe: 0.349922 hartree
zpe.sumelectzpe: -904.525681 hartree
zpe.sumelectthermal: -904.506317 hartree
zpe.sumelectthermalent: -904.505373 hartree
zpe.sumelectthermalfe: -904.571788 hartree
dipole: -2.2193 -1.4917 -1.7711
dipole: 3.2074
quadrupole: -129.1555 -118.4137 -126.3360
quadrupole: -20.4353 3.0265 2.5747
quadrupole: -4.5205 6.2214 -1.7009 -20.4353 3.0265 2.5747
hfenergy: -904.9217098 hartree
pointgroup: C01 [X(C18H25N1O2)]
dipole: 0.8750577 0.5711541 -0.7074015 debye
polarizability: 268.196205|-7.6926201|200.0622748|-7.3026726|-5.3692603|135.6360087 unknown
InChI: InChI=1S/C18H25NO2/c1-18-7-6-11-12(14(18)4-5-17(18)21)3-2-10-8-16(20)15(19)9-13(10)11/h8-9,11-12,14,17,20-21H,2-7,19H2,1H3
charge 0 multiplicity 1
46 atoms
O  5.206675 1.485674 0.218716
O  -5.714116 -0.310286 0.44888
N  -4.809012 2.150604 -0.118151
C  2.863731 0.65006 0.132073
C  2.261023 -0.692666 -0.393124
C  0.797714 -0.884999 0.039472
C  -0.048399 0.291081 -0.545103
C  4.309528 0.505366 -0.410117
C  2.044809 1.818414 -0.464288
C  3.327165 -1.760036 -0.022997
C  0.532398 1.67853 -0.139273
C  4.688792 -0.985594 -0.122136
C  0.186817 -2.226383 -0.41849
C  2.903394 0.748595 1.680579
C  -1.545815 0.121024 -0.233231
C  -1.216778 -2.407765 0.19207
C  -2.095326 -1.163218 0.074903
C  -2.433188 1.228221 -0.301057
C  -3.485157 -1.311117 0.303959
C  -3.814535 1.085866 -0.07236
C  -4.343242 -0.199107 0.233343
H  2.252858 -0.617387 -1.5064
H  0.741278 -0.851685 1.148872
H  0.068518 0.217346 -1.653083
H  4.292328 0.678433 -1.510648
H  2.178034 1.825488 -1.567443
H  2.4225 2.788904 -0.088758
H  3.292229 -2.629938 -0.702666
H  3.161297 -2.141971 1.002187
H  0.352763 1.847074 0.940527
H  -0.007672 2.483828 -0.672826
H  5.242907 -1.031362 0.833883
H  5.345268 -1.401425 -0.908486
H  0.834649 -3.071425 -0.116607
H  0.128152 -2.240412 -1.526689
H  3.464371 1.652496 1.972669
H  1.891912 0.810123 2.116622
H  3.41371 -0.116465 2.13953
H  -1.108446 -2.661738 1.267696
H  -1.734365 -3.268704 -0.273152
H  6.115346 1.377712 -0.158085
H  -2.048126 2.226231 -0.53832
H  -3.908106 -2.294549 0.536242
H  -4.941071 2.579162 -1.040655
H  -4.719557 2.857718 0.619615
H  -6.044052 0.639779 0.324608
