program: Gaussian 09
title: 000238363
version: EM64L-G09RevD.01
frameworkgroup: C1[X(C15H15NO2)]
method: RPBEPBE
basis: SDD
operation: Freq
keyword: #p
keyword: freq=noraman
keyword: PBEPBE/SDD
title: #p freq=noraman PBEPBE/SDD
converged: YES YES NO NO
title: Mulliken charges:
elementType: O O N C C C C C C C C C C C C C C C H H H H H H H H H H H H H H H
charge: -0.408769 -0.235284 -0.029797 -0.308407 -0.431621 -0.484618 0.474265 0.195138 0.146772 -0.376983 -0.429694 -0.363239 -0.237826 -0.226078 -0.242567 -0.176863 -0.362637 -0.187327 0.247468 0.237431 0.249008 0.213874 0.231372 0.262352 0.236618 0.242231 0.226492 0.227140 0.229234 0.237126 0.376281 0.238328 0.230579
chargesum: 0.00000
title: Mulliken charges with hydrogens summed into heavy atoms:
elementType: O O N C C C C C C C C C C C C C C C
charge: -0.032489 -0.235284 -0.029797 -0.060939 0.054818 -0.039371 0.474265 0.195138 0.146772 -0.114631 -0.193076 -0.121008 -0.011334 0.001061 -0.013332 0.060263 -0.124309 0.043253
polarizability: 1.89364421e+02 2.18866014e+01 1.69346035e+02 1.08930781e+01 -1.28246757e+01 1.38148495e+02
1716.lowfreq: -0.0005 0.0007 0.0008 0.8945 3.9820 8.9663 19.0781 28.3707 32.8693
frequency: 18.9503 28.3462 32.8628 40.0127 50.6835 70.4708 109.9116 139.5770 183.7760 204.3934 257.1572 287.6536 327.8705 361.4138 403.3961 403.9617 421.0129 493.5291 500.0211 559.7713 600.0214 608.7226 619.6919 628.0190 633.1241 704.6677 711.7076 741.9691 751.8034 768.5161 786.6054 818.9624 827.2975 855.6261 899.2870 903.1056 935.4094 955.4590 959.1195 978.8557 987.9862 993.5253 997.8189 999.9773 1021.7883 1029.4037 1039.6452 1055.2044 1062.3335 1079.4323 1100.8254 1152.6921 1164.0416 1172.4996 1191.1646 1192.2813 1225.7965 1234.1372 1259.8088 1278.9407 1294.1937 1301.8310 1317.9979 1334.7268 1344.2901 1353.5054 1384.6759 1415.1910 1443.0717 1454.8060 1458.1318 1473.1007 1481.2837 1565.2809 1581.9348 1593.1952 1609.7602 1654.9877 2988.6307 3003.0701 3037.3440 3051.1554 3075.4191 3119.6439 3123.8984 3125.3530 3134.6696 3137.0769 3147.2766 3151.4456 3163.2339 3169.1791 3500.8074
redmass: 4.5675 4.6529 4.9789 5.4074 4.5127 5.0086 4.3821 5.4945 3.0997 4.2145 4.1824 4.1938 5.1205 2.8823 3.1925 2.9781 4.5090 3.4257 3.1581 3.4082 4.4757 3.5864 2.9610 4.7807 2.0942 1.9861 3.4123 1.7211 1.5996 1.9752 2.4872 2.1429 4.1984 1.2467 1.3747 2.4782 1.9604 1.5073 4.5514 1.3999 4.1604 2.5285 1.4550 1.3430 2.8283 2.2031 2.4397 3.0023 2.1484 1.6215 1.6686 1.3187 1.0725 1.0651 1.1147 2.3296 1.3439 1.9887 1.5925 1.5702 1.4016 1.8643 2.1729 1.3701 1.5037 1.6822 5.9727 1.9463 2.1323 2.0582 1.1669 1.1199 2.1609 5.7967 5.8543 6.0608 6.0183 8.2433 1.0607 1.0594 1.0869 1.0976 1.1036 1.0858 1.0881 1.0871 1.0888 1.0919 1.0963 1.0947 1.1016 1.1016 1.0638
irintensity: 2.0867 1.4196 0.7796 1.2291 0.9509 0.2707 1.0614 0.3550 0.3949 0.5881 2.1996 3.3257 1.3669 3.9379 3.0129 1.1188 6.9771 1.1544 14.2325 46.7203 24.1261 19.7844 48.3597 4.7573 64.6625 54.8592 30.8880 16.1009 49.1202 19.6072 25.5790 7.3766 2.6248 0.0642 0.1515 7.6432 3.6277 1.5120 2.7503 0.1003 1.2355 4.8626 0.6831 0.1729 101.3750 34.3646 21.0537 33.9690 119.9555 6.2126 23.6594 3.6295 1.7058 0.2020 0.4211 1.2960 6.1613 2.2113 1.5766 36.4586 1.2335 2.2326 2.8594 11.3616 11.1816 38.5425 3.3846 20.7030 12.0429 45.9940 5.1942 10.0608 24.0446 13.0314 56.7291 2.2248 10.3050 175.8671 10.9040 18.1986 5.5621 1.6512 31.2529 4.9022 17.2971 0.3573 4.8170 15.1359 29.8278 29.2162 23.9329 23.2325 21.1793
temp: 298.150 k
press: 1.00000 atm
elementType: 8 8 7 6 6 6 6 6 6 6 6 6 6 6 6 6 6 6 1 1 1 1 1 1 1 1 1 1 1 1 1 1 1
symmnumber: 1
zpe: 692710.9 jmol-1
zpe.correction: 0.263840 hartree
zpe.thermalcorrener: 0.279961 hartree
zpe.thermalcorrenthalpy: 0.280905 hartree
zpe.thermalcorrgfe: 0.216368 hartree
zpe.sumelectzpe: -784.513062 hartree
zpe.sumelectthermal: -784.496941 hartree
zpe.sumelectthermalent: -784.495996 hartree
zpe.sumelectthermalfe: -784.560534 hartree
dipole: 0.5958 -2.0747 -0.1811
dipole: 2.1662
quadrupole: -91.7859 -97.1555 -107.2986
quadrupole: -2.3192 6.1740 -4.2245
quadrupole: 6.9608 1.5912 -8.5519 -2.3192 6.1740 -4.2245
hfenergy: -784.7769017 hartree
pointgroup: C01 [X(C15H15N1O2)]
dipole: 0.1908951 -0.8188411 -0.1392038 debye
polarizability: 191.9041377|19.7148708|169.1181458|10.8369692|-11.2761276|135.8366672 unknown
InChI: InChI=1S/C15H15NO2/c17-15(18)14(12-6-2-1-3-7-12)10-9-13-8-4-5-11-16-13/h1-8,11,14,17H,9-10H2
charge 0 multiplicity 1
33 atoms
O  -2.364334 3.289136 -0.215402
O  -1.57855 2.473539 1.809273
N  3.303159 0.709157 -0.712871
C  -1.118562 1.214865 -0.282216
C  0.349261 0.92152 0.147955
C  1.011291 -0.167734 -0.733006
C  -2.030673 -0.015709 -0.15684
C  2.479874 -0.342252 -0.392951
C  -1.67932 2.350187 0.568031
C  -2.285174 -0.605099 1.108879
C  -2.610951 -0.593115 -1.3128
C  2.974906 -1.515697 0.23152
C  -3.098854 -1.754657 1.2106
C  -3.424574 -1.745003 -1.211826
C  -3.669615 -2.330774 0.051012
C  4.352047 -1.612715 0.533294
C  4.629395 0.602797 -0.415217
C  5.201781 -0.532427 0.204295
H  -1.127924 1.554594 -1.332989
H  0.362793 0.618847 1.211229
H  0.949448 1.846915 0.065038
H  0.931838 0.137977 -1.794654
H  0.476225 -1.127472 -0.618666
H  -1.860307 -0.151522 2.012019
H  -2.427735 -0.139008 -2.294211
H  2.288118 -2.333977 0.472314
H  -3.292331 -2.198274 2.193899
H  -3.866296 -2.180996 -2.114979
H  -4.301654 -3.222264 0.131759
H  4.753171 -2.511598 1.013981
H  -2.740259 3.996862 0.377041
H  5.25018 1.46406 -0.689992
H  6.274727 -0.564363 0.418484
