program: Gaussian 09
title: 000238361
version: EM64L-G09RevD.01
frameworkgroup: C1[X(C15H14N2)]
method: RPBEPBE
basis: SDD
operation: Freq
keyword: #pfreq=noraman
keyword: PBEPBE/SDD
title: #p freq=noraman PBEPBE/SDD
converged: YES YES NO NO
title: Mulliken charges:
elementType: N N C C C C C C C C C C C C C C C H H H H H H H H H H H H H H
charge: -0.072235 -0.019373 -0.429287 -0.232655 -0.523365 0.449998 0.215185 -0.394157 -0.435045 -0.223546 -0.346224 -0.228768 -0.230571 -0.239903 -0.171029 -0.352602 -0.181466 0.229164 0.236755 0.296023 0.221382 0.254998 0.246390 0.287182 0.241422 0.226460 0.226694 0.228740 0.241328 0.242830 0.235675
chargesum: 0.00000
title: Mulliken charges with hydrogens summed into heavy atoms:
elementType: N N C C C C C C C C C C C C C C C
charge: -0.072235 -0.019373 0.036631 0.063368 -0.046985 0.449998 0.215185 -0.147766 -0.147864 -0.223546 -0.104802 -0.002308 -0.003877 -0.011163 0.070299 -0.109772 0.054209
polarizability: 2.09720892e+02 3.08711124e+00 1.54888433e+02 -1.25249428e+01 1.26151986e+01 1.24186740e+02
1716.lowfreq: -9.8639 -4.5200 -0.0009 0.0002 0.0002 9.5209 20.4285 36.9959 47.0491
frequency: 20.2138 36.9666 46.9959 70.5101 81.4282 120.8278 150.2199 174.6770 206.9018 297.5219 320.9715 335.6850 397.7061 405.3973 406.6329 417.0903 481.9176 518.5411 555.9652 576.7396 616.0265 617.9983 623.4645 709.3301 739.8557 751.8449 764.8177 772.7949 797.6813 853.3551 863.6269 899.5693 930.5106 948.3422 958.6248 969.1500 975.7018 986.4519 991.0367 999.4884 1002.5043 1003.2058 1030.1758 1041.7605 1068.0020 1084.0306 1092.0639 1150.8052 1166.4889 1173.3463 1191.0780 1193.2804 1201.6933 1235.9762 1267.7021 1291.7177 1296.4291 1317.9163 1325.8166 1342.9743 1349.5846 1384.3215 1415.7234 1444.2748 1453.7419 1463.0536 1464.5408 1483.8938 1563.8229 1583.0909 1593.6641 1612.8376 2186.6664 2990.5401 3000.1678 3004.4812 3056.0419 3064.9364 3120.3090 3123.3558 3129.2315 3134.8570 3137.5518 3145.8129 3154.2408 3162.8205 3172.6350
redmass: 4.6823 5.3851 3.8940 5.6184 5.4908 6.5088 5.2442 3.2736 4.7742 2.9590 3.6517 4.5354 2.2429 3.1522 3.1040 6.9318 4.2596 3.8844 4.2033 2.7989 6.3844 5.9368 6.2296 1.8764 2.8917 1.7647 1.9544 2.4672 2.8927 2.3290 1.2527 1.3066 1.4579 2.4845 1.9338 2.6188 3.6317 1.7136 3.0554 2.8804 1.3809 1.3440 2.1901 2.3552 3.2665 1.6232 1.6670 1.2967 1.0744 1.0557 1.2606 1.1307 1.8883 2.1822 1.4384 1.3672 2.1745 2.1229 1.3714 1.3389 1.3879 6.5254 1.9357 2.1134 1.6818 1.3131 1.1276 2.2018 5.7791 5.7155 6.0846 5.8933 12.5596 1.0629 1.0783 1.0613 1.1024 1.1027 1.0855 1.0885 1.0881 1.0921 1.0892 1.0962 1.0949 1.1015 1.1015
irintensity: 2.0819 1.4025 0.2957 0.5533 0.5216 4.3177 2.7723 3.7630 0.2236 0.4828 2.1121 0.8467 3.3150 1.7753 0.9411 1.4914 2.7729 4.0951 19.0033 7.8927 0.4089 0.2333 1.2063 51.6480 7.7335 32.9386 36.4141 37.5683 14.6651 5.8251 0.2328 0.4449 3.1994 5.7566 2.3316 12.9276 3.5846 1.1248 0.1165 1.1929 0.0877 1.5828 6.9398 3.0337 7.6939 3.9140 7.8634 3.1202 2.8740 0.0106 8.4982 2.7801 2.4681 1.4619 4.5028 10.4860 9.7000 8.0463 9.7694 0.5976 13.8797 0.1125 15.7674 6.8722 17.5871 27.2367 18.4636 24.2590 10.1309 47.9213 1.0476 6.5251 19.4322 27.3768 14.9854 16.2245 27.8262 18.0028 1.8004 3.5785 12.2110 5.2612 3.1457 26.4310 23.6697 33.0186 21.9091
temp: 298.150 k
press: 1.00000 atm
elementType: 7 7 6 6 6 6 6 6 6 6 6 6 6 6 6 6 6 1 1 1 1 1 1 1 1 1 1 1 1 1 1
symmnumber: 1
zpe: 653554.3 jmol-1
zpe.correction: 0.248926 hartree
zpe.thermalcorrener: 0.263619 hartree
zpe.thermalcorrenthalpy: 0.264563 hartree
zpe.thermalcorrgfe: 0.204851 hartree
zpe.sumelectzpe: -688.288827 hartree
zpe.sumelectthermal: -688.274134 hartree
zpe.sumelectthermalent: -688.273190 hartree
zpe.sumelectthermalfe: -688.332902 hartree
dipole: 3.9152 -3.2871 2.5274
dipole: 5.7027
quadrupole: -80.5716 -113.3494 -97.9869
quadrupole: 8.1145 -5.4598 10.8131
quadrupole: 16.7310 -16.0467 -0.6843 8.1145 -5.4598 10.8131
hfenergy: -688.537753 hartree
pointgroup: C01 [X(C15H14N2)]
dipole: 1.6829372 1.2499086 -0.7995685 debye
polarizability: 206.1049698|-7.2542026|154.5198485|20.6652348|12.3259798|128.1712461 unknown
InChI: InChI=1S/C15H14N2/c16-12-14(13-6-2-1-3-7-13)9-10-15-8-4-5-11-17-15/h1-8,11,14H,9-10H2
charge 0 multiplicity 1
31 atoms
N  1.936243 0.59525 0.752847
N  -1.740599 -3.440727 0.923023
C  0.150343 -1.303346 -1.10985
C  -0.71597 -1.087874 0.184341
C  1.062318 -0.09144 -1.451198
C  -1.799195 -0.016349 -0.014743
C  2.225916 0.084677 -0.491218
C  -3.040181 -0.327589 -0.624632
C  -1.537012 1.319373 0.381174
C  -1.292642 -2.382385 0.599824
C  3.550994 -0.271389 -0.854829
C  -4.004276 0.682354 -0.838323
C  -2.502328 2.329389 0.16595
C  -3.737848 2.014965 -0.44554
C  4.600278 -0.096767 0.074301
C  2.959041 0.755995 1.642237
C  4.302399 0.428848 1.352054
H  0.771292 -2.210246 -0.97966
H  -0.532299 -1.492458 -1.959474
H  -0.031119 -0.745983 0.984893
H  1.454212 -0.231553 -2.475193
H  0.451146 0.829597 -1.454106
H  -3.261708 -1.362481 -0.913246
H  -0.575369 1.555401 0.852508
H  3.749797 -0.674598 -1.853365
H  -4.964053 0.429337 -1.30276
H  -2.291258 3.358106 0.479435
H  -4.488074 2.797115 -0.607639
H  5.628305 -0.363892 -0.19302
H  2.680378 1.164335 2.620667
H  5.08347 0.582637 2.10284
