program: Gaussian 09
title: 000238347
version: EM64L-G09RevD.01
frameworkgroup: C1[X(C14H11NO2)]
method: RPBEPBE
basis: SDD
operation: Freq
keyword: #p
keyword: freq=noraman
keyword: PBEPBE/SDD
title: #p freq=noraman PBEPBE/SDD
converged: YES YES NO NO
title: Mulliken charges:
elementType: O O N C C C C C C C C C C C C C C H H H H H H H H H H H
charge: -0.222262 -0.210402 0.006657 -0.683614 0.298712 0.150690 0.165851 0.314252 -0.346184 -0.350189 -0.286099 -0.299129 -0.251718 -0.228450 -0.217801 -0.337673 -0.355875 0.266862 0.266455 0.280419 0.276878 0.272491 0.285432 0.236399 0.236385 0.236202 0.248059 0.247652
chargesum: 0.00000
title: Mulliken charges with hydrogens summed into heavy atoms:
elementType: O O N C C C C C C C C C C C C C C
charge: -0.222262 -0.210402 0.006657 -0.150297 0.298712 0.150690 0.165851 0.314252 -0.065765 -0.073311 -0.013608 -0.013697 -0.015319 0.007935 0.018400 -0.089614 -0.108223
polarizability: 2.21319885e+02 1.24608445e+01 1.67625392e+02 -4.72721928e+00 -1.34173150e+00 9.63956246e+01
1716.lowfreq: -13.9045 -5.6122 -5.3390 -0.0002 0.0006 0.0007 17.8621 46.7192 60.7890
frequency: 17.8564 46.6941 60.7677 64.9106 126.6012 141.3861 149.6265 188.6959 236.5708 317.1778 367.1689 390.2504 400.9107 414.6275 432.3560 463.3702 481.7248 519.3691 589.4843 612.1587 635.9809 658.3730 691.4608 697.2633 736.0956 741.3088 765.4660 813.4393 857.7343 863.3416 897.3516 934.9262 953.8304 958.7460 978.3920 986.8971 988.4510 992.6771 996.9416 1011.8723 1021.1802 1046.5725 1063.8924 1090.0136 1094.2262 1140.0945 1175.4614 1195.8855 1218.8323 1232.0218 1258.2915 1293.3890 1299.0510 1326.6467 1333.3785 1388.9895 1401.4335 1436.6891 1457.5794 1466.8660 1483.2908 1540.0677 1560.5037 1577.5475 1588.1827 1596.8805 1611.4234 3043.1068 3114.2420 3131.9142 3138.4064 3140.7917 3142.1322 3151.5633 3159.0213 3161.3658 3171.3274 3171.5717
redmass: 7.1541 3.9173 5.2726 5.8558 9.7180 6.2428 6.0371 5.4981 4.8100 7.8367 2.5239 4.6404 2.8542 5.0329 4.1758 3.3664 5.9004 5.4103 3.9370 6.4266 4.0559 6.9625 5.1971 2.0444 4.1489 3.1936 1.9882 2.0212 2.1673 1.2466 1.2542 2.5475 1.5261 5.2498 2.5668 1.9632 2.5042 1.6689 1.5604 1.3549 2.6345 2.8225 1.9330 1.6162 1.7466 1.4152 1.0657 1.1566 1.4292 2.1048 1.6390 2.9410 8.8637 1.3242 1.3690 8.4695 1.8860 2.2626 1.3895 1.5231 1.9253 8.2866 7.9961 5.3056 7.0540 7.0966 6.2547 1.0573 1.1048 1.0856 1.0880 1.0907 1.0885 1.0930 1.0977 1.0964 1.1004 1.0978
irintensity: 0.8462 0.1294 0.8472 2.6261 4.4020 2.8275 2.3163 1.3964 15.5042 0.4583 0.3129 1.2712 0.1120 0.0921 6.9829 3.9084 3.0321 28.0841 47.2605 0.3165 5.4368 1.5606 5.9635 39.6025 0.1623 15.5394 55.1883 27.0524 50.2659 0.6514 0.9433 58.5638 9.3415 8.4243 8.6375 0.6012 2.7986 0.2501 0.6614 1.5147 39.5452 82.4042 3.9676 9.0924 3.8105 5.4765 6.0559 71.9608 117.8372 334.8881 94.2678 52.1439 0.5853 1.1564 7.5291 3.9112 29.7430 23.3578 14.3131 14.2539 8.5358 120.4673 147.8703 3.1129 48.0023 10.7009 14.7947 2.8947 6.0295 0.5884 22.4723 5.3566 8.1271 3.8851 12.9125 11.5162 36.1074 5.0752
temp: 298.150 k
press: 1.00000 atm
elementType: 8 8 7 6 6 6 6 6 6 6 6 6 6 6 6 6 6 1 1 1 1 1 1 1 1 1 1 1
symmnumber: 1
zpe: 559888.7 jmol-1
zpe.correction: 0.213250 hartree
zpe.thermalcorrener: 0.227232 hartree
zpe.thermalcorrenthalpy: 0.228176 hartree
zpe.thermalcorrgfe: 0.170244 hartree
zpe.sumelectzpe: -744.097403 hartree
zpe.sumelectthermal: -744.083422 hartree
zpe.sumelectthermalent: -744.082478 hartree
zpe.sumelectthermalfe: -744.140409 hartree
dipole: 3.1540 0.9334 0.7707
dipole: 3.3783
quadrupole: -94.3480 -100.0517 -97.1397
quadrupole: -1.8076 -7.6408 -1.1418
quadrupole: 2.8318 -2.8719 0.0401 -1.8076 -7.6408 -1.1418
hfenergy: -744.3106537 hartree
pointgroup: C01 [X(C14H11N1O2)]
dipole: -1.2498383 -0.4477649 -0.0629114 debye
polarizability: 221.6997707|3.3045816|126.1022383|12.3114595|34.9086278|137.5388926 unknown
InChI: InChI=1S/C14H11NO2/c16-13(11-4-2-1-3-5-11)10-14(17)12-6-8-15-9-7-12/h1-9H,10H2
charge 0 multiplicity 1
28 atoms
O  -0.525454 0.672888 2.052324
O  0.502943 -2.10075 -1.233349
N  4.585032 0.78022 -0.218068
C  -0.03434 -1.493202 1.062141
C  -2.182255 -0.100707 0.477192
C  -0.906779 -0.226069 1.245245
C  0.849495 -1.4614 -0.198473
C  2.12947 -0.673817 -0.170556
C  -2.568319 -1.03507 -0.52395
C  -3.02729 1.009295 0.762909
C  3.021734 -0.780925 -1.27087
C  2.486729 0.184303 0.902574
C  -3.78255 -0.858379 -1.221084
C  -4.240599 1.176164 0.070369
C  -4.622011 0.240403 -0.923283
C  4.225529 -0.048253 -1.248081
C  3.711637 0.886553 0.827272
H  0.595697 -1.57384 1.962653
H  -0.67392 -2.386809 0.985911
H  -1.916312 -1.876486 -0.780305
H  -2.706968 1.721292 1.53064
H  2.763285 -1.428934 -2.113689
H  1.825628 0.334162 1.762009
H  -4.072697 -1.574829 -1.996805
H  -4.889437 2.028669 0.298007
H  -5.566777 0.369297 -1.463278
H  4.940684 -0.114542 -2.075142
H  4.015241 1.563968 1.63279
