program: Gaussian 09
title: 000238345
version: EM64L-G09RevD.01
frameworkgroup: C1[X(C14H11ClF2O)]
method: RPBEPBE
basis: SDD
operation: Freq
keyword: #p
keyword: freq=noraman
keyword: PBEPBE/SDD
title: #p freq=noraman PBEPBE/SDD
converged: YES YES NO NO
title: Mulliken charges:
elementType: Cl F F O C C C C C C C C C C C C C C H H H H H H H H H H H
charge: 0.064791 -0.133466 -0.141876 -0.436342 0.013560 0.342683 0.367175 -0.059557 -0.343085 -0.353870 -0.382760 -0.370833 -0.229004 -0.228604 -0.239207 -0.217941 -0.237135 -0.238399 0.268584 0.251617 0.265118 0.289074 0.366997 0.231268 0.228437 0.230959 0.228681 0.233238 0.229896
chargesum: 0.00000
title: Mulliken charges with hydrogens summed into heavy atoms:
elementType: Cl F F O C C C C C C C C C C C C C C
charge: 0.064791 -0.133466 -0.141876 -0.069344 0.013560 0.342683 0.367175 -0.059557 -0.074501 -0.102254 -0.117642 -0.081759 0.002264 -0.000167 -0.008248 0.010740 -0.003897 -0.008503
polarizability: 1.95650661e+02 6.55769381e+00 1.39250427e+02 -1.79535939e+01 8.26821240e-02 1.30090127e+02
1716.lowfreq: -14.1857 -9.0473 -0.0017 -0.0014 0.0015 9.3751 23.4067 46.9832 59.5214
frequency: 22.9562 46.9401 59.4774 72.7958 91.5306 124.4884 206.7919 213.2223 222.1503 258.7225 278.9752 287.3058 301.6885 330.0186 360.9150 380.8917 383.9618 399.6306 403.1677 458.0956 512.7243 539.2516 583.3093 614.8939 615.8232 625.6897 666.6401 701.5697 702.9044 755.4905 765.6100 797.8506 851.1864 858.3729 872.8307 921.4006 929.0825 952.9367 977.4613 983.8679 987.4135 990.8197 991.1981 992.4872 1000.0408 1001.1348 1028.4119 1031.8087 1082.4136 1087.4940 1106.9696 1158.8044 1173.7793 1176.3284 1190.4348 1193.0364 1206.5154 1305.3943 1329.6727 1334.9066 1379.6596 1384.3658 1435.8488 1437.3178 1480.6678 1483.5233 1591.1282 1594.2981 1609.7084 1612.7226 3126.9077 3129.7647 3137.8851 3140.3988 3150.2130 3153.8718 3164.0454 3165.8845 3182.8928 3184.0526 3551.2185
redmass: 4.3191 3.9368 5.2607 10.6238 7.7532 7.8921 5.9440 6.8756 5.8139 6.4277 9.8149 4.9150 3.2347 3.4456 2.4864 7.5376 5.4044 2.7513 2.8154 4.5257 4.4850 8.0731 6.1731 6.4292 6.4249 6.0587 6.9265 1.7373 1.9178 2.0110 1.9625 4.9921 1.2547 1.2506 4.2374 1.6522 1.6782 3.3008 1.6753 1.5294 3.9586 7.1718 6.2493 3.6939 1.3833 1.3458 2.2603 2.3263 3.3424 1.6138 2.2217 2.0632 1.0637 1.0530 3.3858 1.1881 1.1397 1.6085 1.3580 1.3495 7.7676 9.2403 2.2040 2.2439 2.2307 2.1143 5.9615 6.3200 5.9174 5.9585 1.0851 1.0851 1.0889 1.0891 1.0942 1.0941 1.0993 1.0989 1.0956 1.0954 1.0658
irintensity: 0.0460 0.0785 0.3758 0.3213 0.2517 0.7481 0.3480 0.8121 2.9099 4.3590 2.2062 3.0246 22.0920 39.9387 77.6357 8.1764 18.5729 7.8856 2.7554 2.2505 0.2368 1.9061 11.9716 0.2488 0.5898 48.6378 27.9999 54.5001 46.8599 125.7461 55.6443 106.8638 1.6909 0.5896 61.9528 18.7420 26.9940 86.7353 15.6644 4.3591 9.5880 82.1244 2.8833 56.8891 4.0591 4.4706 5.5466 16.8555 29.9638 1.4293 36.1282 43.5644 0.4395 0.0893 2.9739 2.4266 2.9741 21.4099 23.0322 4.9903 0.0851 0.4074 16.9937 15.9887 15.4813 14.3413 2.6136 0.2318 2.8910 0.0589 0.1863 0.0688 9.2553 9.8858 29.0191 21.1932 19.7222 21.0493 4.5269 4.0785 18.3742
temp: 298.150 k
press: 1.00000 atm
elementType: 17 9 9 8 6 6 6 6 6 6 6 6 6 6 6 6 6 6 1 1 1 1 1 1 1 1 1 1 1
symmnumber: 1
zpe: 553859.4 jmol-1
zpe.correction: 0.210954 hartree
zpe.thermalcorrener: 0.226827 hartree
zpe.thermalcorrenthalpy: 0.227771 hartree
zpe.thermalcorrgfe: 0.166608 hartree
zpe.sumelectzpe: -1273.764952 hartree
zpe.sumelectthermal: -1273.749079 hartree
zpe.sumelectthermalent: -1273.748135 hartree
zpe.sumelectthermalfe: -1273.809298 hartree
dipole: 1.7330 -2.2280 0.3870
dipole: 2.8491
quadrupole: -98.6064 -110.4452 -106.4315
quadrupole: 2.8780 -1.5858 1.7815
quadrupole: 6.5546 -5.2842 -1.2705 2.8780 -1.5858 1.7815
hfenergy: -1273.975906 hartree
pointgroup: C01 [X(C14H11Cl1F2O1)]
dipole: -0.5357066 -0.9837451 -0.0410768 debye
polarizability: 194.9602295|0.805449|137.9897787|-20.1194589|-3.7117406|132.0412075 unknown
InChI: InChI=1S/C14H11ClF2O/c15-14(16,17)13(18,11-7-3-1-4-8-11)12-9-5-2-6-10-12/h1-10,18H
charge 0 multiplicity 1
29 atoms
Cl 1.668682 2.94768 -0.478032
F  0.119695 2.030291 1.465804
F  -0.973893 2.849555 -0.351344
O  0.067735 0.785286 -2.028971
C  0.008762 0.609526 -0.56975
C  -1.322531 -0.083723 -0.192576
C  1.225666 -0.244139 -0.17186
C  0.140546 2.044599 0.046049
C  -1.598602 -1.291591 -0.889494
C  1.2875 -0.830484 1.115947
C  -2.255156 0.384991 0.764536
C  2.289243 -0.439894 -1.083962
C  -2.782028 -2.013251 -0.636874
C  2.409199 -1.601105 1.490291
C  -3.442079 -0.342563 1.015783
C  3.4061 -1.219267 -0.70894
C  -3.71161 -1.540112 0.31956
C  3.472147 -1.79885 0.578622
H  -0.873661 -1.658434 -1.623759
H  0.460743 -0.693226 1.820896
H  -2.078335 1.308442 1.320782
H  2.228341 0.012401 -2.07667
H  -0.78521 1.191868 -2.331965
H  -2.978526 -2.943064 -1.181899
H  2.451122 -2.049221 2.48909
H  -4.155726 0.033071 1.757289
H  4.224736 -1.370949 -1.42119
H  -4.632545 -2.09925 0.518407
H  4.340986 -2.400385 0.868629
