program: Gaussian 09
title: 000238322
version: EM64L-G09RevD.01
frameworkgroup: C1[X(C11H18N2)]
method: RPBEPBE
basis: SDD
operation: Freq
keyword: #pfreq=noraman
keyword: PBEPBE/SDD
title: #p freq=noraman PBEPBE/SDD
converged: NO YES NO NO
title: Mulliken charges:
elementType: N N C C C C C C C C C C C H H H H H H H H H H H H H H H H H H
charge: -0.292215 -0.026676 -0.049756 -0.375607 -0.360016 -0.499354 -0.693570 -0.718700 0.186205 -0.357448 -0.178147 -0.363309 -0.188142 0.190818 0.185973 0.210484 0.181796 0.242551 0.245658 0.189978 0.244199 0.201649 0.204744 0.237731 0.208911 0.209716 0.219786 0.237663 0.236445 0.238333 0.230300
chargesum: 0.00000
title: Mulliken charges with hydrogens summed into heavy atoms:
elementType: N N C C C C C C C C C C C
charge: -0.046557 -0.026676 0.141061 0.020850 0.064331 -0.065177 -0.049446 -0.080288 0.186205 -0.119785 0.058299 -0.124975 0.042158
polarizability: 1.75284026e+02 -2.67659767e+00 1.26315079e+02 -1.09924882e+01 1.29995613e+00 9.04731024e+01
1716.lowfreq: -9.5527 -5.6388 -0.0001 0.0004 0.0005 11.8602 16.4244 23.6947 53.3059
frequency: 16.0715 23.5614 53.3018 59.2356 103.7184 119.0696 155.0302 198.8281 209.5558 248.3841 311.2878 319.0702 354.9585 359.3071 387.1253 404.4418 508.6138 554.4237 607.0072 628.9996 688.0267 750.5286 770.8899 794.6567 797.4332 831.9677 897.9560 899.3365 927.0106 954.6133 956.6675 959.0230 963.0705 990.6296 999.1977 1029.2045 1038.5809 1046.1296 1092.6183 1103.5377 1130.9551 1147.3352 1163.6269 1190.6574 1196.2682 1232.0761 1244.6365 1271.3022 1281.6315 1299.6067 1310.0766 1324.6916 1330.0965 1344.5520 1371.2068 1374.1827 1394.0565 1413.8356 1445.0028 1455.6171 1461.2795 1463.2865 1469.0952 1476.4556 1488.3262 1493.1497 1497.1823 1564.5764 1581.7148 2838.7604 2849.3668 2965.5359 2966.5970 2976.6620 2990.1386 3003.9774 3024.4900 3058.4124 3065.6983 3068.6899 3069.1354 3085.1168 3122.9150 3133.0010 3149.8698 3168.5555 3424.7292
redmass: 3.8046 3.4499 3.6084 2.8461 2.9313 2.2192 2.6902 1.4087 2.2489 1.0521 3.1355 3.4047 2.0702 2.3056 2.4546 3.4823 2.8941 3.0567 4.5429 4.9620 1.3461 1.7081 2.0953 2.7167 1.2672 3.8648 1.3219 1.3188 1.2960 1.4786 1.9155 3.0387 2.1551 2.0171 1.3399 1.6797 2.5793 2.9919 1.5383 2.3119 1.3580 2.5329 1.0719 1.6506 1.9839 1.8581 1.2862 1.2226 1.6121 1.8571 1.9691 1.8980 1.5124 1.3689 1.2314 1.3062 1.2598 1.9319 1.2261 2.1451 1.1243 1.0512 1.0598 1.0711 1.0600 1.0702 1.0676 5.7535 5.8842 1.0713 1.0710 1.0528 1.0601 1.0410 1.0629 1.0872 1.0856 1.0998 1.0994 1.0986 1.1003 1.0993 1.0881 1.0888 1.0947 1.1015 1.0733
irintensity: 1.4963 0.2643 0.4753 0.6729 1.2169 3.5654 1.7757 1.5928 0.7004 0.1215 1.8892 1.4318 0.5505 2.3939 1.2080 4.2613 16.0969 10.6031 3.8779 4.6061 69.9077 35.8698 21.1399 9.8375 6.4161 5.9052 0.5114 1.9916 2.8175 0.6506 1.9611 2.6614 0.5567 17.9111 0.1354 1.0108 3.3902 5.1028 4.7565 77.6111 6.6209 18.7087 1.9627 5.7948 5.3617 0.9438 20.8057 3.4971 4.8237 1.2116 3.0929 1.3563 2.7664 25.9194 25.7350 12.4286 12.4819 19.0949 45.2371 28.2101 12.2798 4.7389 10.0684 10.8203 11.3390 6.4571 12.5268 12.9158 51.1528 50.7644 177.2001 38.4817 44.1972 30.6480 25.7726 32.6108 18.9945 45.0266 21.7577 74.4383 20.0308 46.9629 16.8437 4.2826 31.3060 23.5143 1.7104
temp: 298.150 k
press: 1.00000 atm
elementType: 7 7 6 6 6 6 6 6 6 6 6 6 6 1 1 1 1 1 1 1 1 1 1 1 1 1 1 1 1 1 1
symmnumber: 1
zpe: 708734.8 jmol-1
zpe.correction: 0.269943 hartree
zpe.thermalcorrener: 0.284088 hartree
zpe.thermalcorrenthalpy: 0.285032 hartree
zpe.thermalcorrgfe: 0.226337 hartree
zpe.sumelectzpe: -538.442534 hartree
zpe.sumelectthermal: -538.428389 hartree
zpe.sumelectthermalent: -538.427445 hartree
zpe.sumelectthermalfe: -538.486140 hartree
dipole: -1.1653 -2.4163 1.1285
dipole: 2.9103
quadrupole: -67.9315 -77.6696 -82.9634
quadrupole: 1.1654 -1.1313 2.3954
quadrupole: 8.2567 -1.4814 -6.7752 1.1654 -1.1313 2.3954
hfenergy: -538.7124769 hartree
pointgroup: C01 [X(C11H18N2)]
dipole: 0.4456842 1.0143551 0.2889656 debye
polarizability: 175.0531448|-0.3038658|124.9500129|12.2059328|-6.8474645|92.0690496 unknown
InChI: InChI=1S/C11H18N2/c1-10(2)9-12-8-6-11-5-3-4-7-13-11/h3-5,7,10,12H,6,8-9H2,1-2H3
charge 0 multiplicity 1
31 atoms
N  -1.962785 0.201363 -0.10324
N  2.283274 -1.106626 -0.06575
C  -4.411747 -0.09989 0.424077
C  -2.966022 0.034018 0.972856
C  -0.559284 0.142443 0.355895
C  0.410756 0.271691 -0.845605
C  -4.58552 -1.396615 -0.3998
C  -4.832965 1.144708 -0.396335
C  1.858401 0.15246 -0.41215
C  2.719434 1.277919 -0.336459
C  4.051254 1.105872 0.102816
C  3.570799 -1.258131 0.35716
C  4.491353 -0.189338 0.458239
H  -5.074713 -0.15644 1.313692
H  -2.938825 0.872513 1.716365
H  -2.707684 -0.890228 1.526879
H  -0.312286 0.928158 1.115974
H  -0.386578 -0.838359 0.837515
H  -2.138252 1.062103 -0.641534
H  0.246646 1.242216 -1.353843
H  0.167423 -0.536015 -1.558205
H  -5.604601 -1.466236 -0.824688
H  -4.414886 -2.292379 0.226431
H  -3.853875 -1.41986 -1.226795
H  -4.271161 1.203308 -1.348252
H  -4.662737 2.08113 0.169423
H  -5.9065 1.096939 -0.655699
H  2.346696 2.267415 -0.622087
H  4.731083 1.962603 0.165441
H  3.868672 -2.280714 0.61857
H  5.51503 -0.370326 0.801011
