program: Gaussian 09
title: 000238299
version: EM64L-G09RevD.01
frameworkgroup: C1[X(C9H11NO)]
method: RPBEPBE
basis: SDD
operation: Freq
keyword: #p
keyword: freq=noraman
keyword: PBEPBE/SDD
title: #p freq=noraman PBEPBE/SDD
converged: YES YES NO NO
title: Mulliken charges:
elementType: O N C C C C C C C C C H H H H H H H H H H H
charge: -0.204653 -0.007051 -0.637169 0.480459 0.243649 -0.471572 -0.670552 -0.319019 -0.359663 -0.327697 -0.325197 0.258086 0.211644 0.238802 0.234958 0.229539 0.234128 0.212993 0.261513 0.234416 0.241906 0.240482
chargesum: 0.00000
title: Mulliken charges with hydrogens summed into heavy atoms:
elementType: O N C C C C C C C C C
charge: -0.204653 -0.007051 -0.167439 0.480459 0.243649 0.002188 0.006107 -0.057507 -0.125247 -0.085791 -0.084715
polarizability: 1.21589620e+02 5.73296892e+00 1.04716706e+02 1.25904751e+01 -7.87496122e+00 7.54988608e+01
1716.lowfreq: -4.4005 -0.0004 0.0004 0.0005 4.9666 15.5588 28.1914 31.9843 53.0060
frequency: 27.7219 31.6115 52.8280 98.9987 176.3604 210.9690 237.9450 301.7539 367.8849 390.5290 455.2517 486.5587 570.1561 610.8275 662.5080 738.0347 753.2378 784.9820 807.3685 847.5484 885.3386 921.5945 959.1566 963.4412 977.9737 1000.5350 1042.9554 1063.6493 1067.1180 1087.7378 1108.9913 1196.0579 1207.9930 1222.4279 1230.7137 1271.4140 1309.2662 1332.9494 1340.4441 1398.9245 1404.0140 1428.5289 1456.9855 1465.6397 1470.4454 1478.5813 1556.5288 1579.4857 1635.5879 2960.0525 2999.4685 3006.1733 3010.7155 3077.7360 3096.0042 3102.0608 3124.3919 3132.3252 3147.4076 3158.4354
redmass: 4.5170 3.7261 1.9019 4.1363 1.3083 3.7363 3.4392 3.9581 2.4832 2.4133 3.8045 3.2112 3.8474 2.6881 6.7770 3.3872 2.3388 2.1225 1.8143 1.8317 1.2498 2.0884 6.1524 1.4051 1.4815 1.8204 1.7800 2.2461 1.7283 1.6961 1.8399 1.5148 2.3641 1.4007 1.2565 1.4250 6.0258 1.6282 1.4596 1.2091 2.0157 1.0921 1.1667 1.7622 1.0393 1.0501 6.8883 5.5333 8.1657 1.0621 1.0368 1.0908 1.0621 1.1044 1.1005 1.0999 1.0875 1.0886 1.0970 1.0984
irintensity: 4.0052 0.8184 1.8586 1.2824 0.4677 1.6709 2.4491 3.4601 0.0184 6.0456 0.4793 12.4855 7.5893 24.8084 0.7558 2.8916 5.7216 11.2960 20.8698 22.7387 0.3494 13.0047 2.3443 1.3709 0.4150 15.8244 16.9569 5.2322 6.6698 0.2238 37.0059 48.4132 0.9270 3.7467 13.3769 26.9089 1.8068 19.6778 29.9648 19.9994 19.5886 26.3336 17.0470 9.0948 13.0109 12.7803 15.5582 86.6403 90.9721 20.8674 25.2004 5.2428 21.9710 8.7258 28.2883 26.3898 8.0738 15.3155 33.1757 3.5823
temp: 298.150 k
press: 1.00000 atm
elementType: 8 7 6 6 6 6 6 6 6 6 6 1 1 1 1 1 1 1 1 1 1 1
symmnumber: 1
zpe: 469488.4 jmol-1
zpe.correction: 0.178819 hartree
zpe.thermalcorrener: 0.189635 hartree
zpe.thermalcorrenthalpy: 0.190580 hartree
zpe.thermalcorrgfe: 0.140085 hartree
zpe.sumelectzpe: -478.708089 hartree
zpe.sumelectthermal: -478.697272 hartree
zpe.sumelectthermalent: -478.696328 hartree
zpe.sumelectthermalfe: -478.746822 hartree
dipole: 1.8159 -2.6326 1.7618
dipole: 3.6513
quadrupole: -76.6201 -62.6400 -65.1888
quadrupole: -6.0406 -2.3279 -2.2496
quadrupole: -8.4704 5.5096 2.9608 -6.0406 -2.3279 -2.2496
hfenergy: -478.8869074 hartree
pointgroup: C01 [X(C9H11N1O1)]
dipole: -0.7486043 -0.7249384 -0.9887855 debye
dipolederiv: -0.6096572 0.0426704 0.1019118 0.1655551 -0.7843668 -0.0813339 0.25607 -0.1474212 -0.3638999 -0.3779738 0.0315028 -0.0445997 0.0311195 -0.3498713 -0.0330518 -0.0695601 -0.0331013 -0.3048198 -0.6847462 0.1541204 0.0962368 0.1870899 0.0129826 0.0882336 0.1155378 0.0321007 0.0052531 0.441947 -0.133294 0.1788845 -0.1873186 0.1415985 -0.0114088 0.4566797 -0.0717397 0.0910081 1.1176726 0.0568386 -0.2978009 0.0175186 0.8959075 0.0837635 -0.6918891 0.2204725 0.2295011 -0.106767 -0.1626883 0.0756118 -0.2630836 -0.2527301 -0.0022666 0.1051735 -0.0774528 0.1149445 -0.0041239 0.0184701 0.0547683 -0.0218837 0.0735248 -0.0101241 0.053326 -0.003029 0.0072708 -0.2863455 -0.0866881 -0.142052 -0.0523325 -0.0199625 0.0054992 -0.1893834 -0.0138637 -0.2139969 -0.3085369 0.1702914 0.0033581 0.1392913 -0.1404705 0.0766592 -0.0898269 0.1436096 -0.0576172 0.1740325 0.0590328 0.2056441 -0.054937 0.1790934 0.0872239 0.1605981 0.1948707 0.158355 0.1796419 -0.2182583 0.0625105 -0.0886379 0.2766865 0.0989136 0.142217 -0.0042995 0.0395126 0.0488122 -0.0230811 0.0059843 -0.0181615 -0.0334229 0.0936157 -0.0146079 0.0372884 0.0308463 0.0504461 -0.0078786 -0.0317645 -0.0555261 -0.0168706 -0.1361303 -0.0391056 -0.0690067 -0.007485 -0.0455601 0.1056423 0.0002668 0.1182721 -0.003894 0.0084515 0.0246535 0.0508194 0.0754428 0.0560775 -0.047363 -0.0222096 0.0044496 0.0911588 -0.0228215 -0.0158694 -0.0300153 -0.1217378 0.03976 -0.0180964 -0.0973071 0.002124 0.091043 -0.0552364 -0.0495845 -0.0246954 -0.0944711 0.0178922 0.0792565 -0.0159694 0.1484402 -0.0227988 0.0345142 -0.0315533 0.0560969 0.0650591 -0.0289513 -0.1076435 0.0400992 -0.1550452 -0.0747217 0.0300148 0.0437535 0.0061824 0.0846105 0.1027681 0.0903388 -0.005521 0.0612765 -0.0064083 -0.0258965 -0.0015279 -0.0161404 0.1193732 0.088335 -0.0534396 -0.0940251 -0.0333854 0.0294154 -0.0843795 -0.0749361 -0.1080846 0.0191269 0.0708626 -0.0382459 -0.068245 -0.0298506 -0.0011865 -0.0950988 -0.0721822 -0.1065611 0.0217877 0.064414 0.0885127 -0.0057821 0.0850252 -0.0847066 -0.0491411 -0.0179828 -0.0360297 0.101936 unknown
polarizability: 116.0955113|-12.447004|102.4106759|15.8445689|10.9478787|83.2990004 unknown
InChI: InChI=1S/C9H11NO/c1-2-9(11)7-8-3-5-10-6-4-8/h3-6H,2,7H2,1H3
charge 0 multiplicity 1
22 atoms
O  -2.153072 1.93747 -0.098728
N  2.763414 -0.580085 0.960255
C  -0.679687 0.593466 -1.502289
C  0.520694 0.180935 -0.654872
C  -1.924869 0.812342 -0.612726
C  -2.820989 -0.401982 -0.381852
C  -3.915068 -0.181577 0.675968
C  1.066581 1.066402 0.310436
C  1.122589 -1.095019 -0.785614
C  2.172097 0.647918 1.082782
C  2.229484 -1.426178 0.030385
H  -0.468992 1.550342 -2.012833
H  -0.88593 -0.17967 -2.263548
H  -2.169258 -1.261004 -0.119343
H  -3.270423 -0.669278 -1.362805
H  -3.470212 0.049927 1.65913
H  -4.559977 0.670412 0.401896
H  -4.544413 -1.082903 0.780008
H  0.631585 2.060401 0.460021
H  0.747854 -1.820343 -1.51684
H  2.611849 1.313412 1.834225
H  2.715443 -2.404788 -0.057855
