program: Gaussian 09
title: 000238298
version: EM64L-G09RevD.01
frameworkgroup: C1[X(C9H6F3NO2)]
method: RPBEPBE
basis: SDD
operation: Freq
keyword: #p
keyword: freq=noraman
keyword: PBEPBE/SDD
title: #p freq=noraman PBEPBE/SDD
converged: YES YES NO NO
title: Mulliken charges:
elementType: F F F O O N C C C C C C C C C H H H H H H
charge: -0.167093 -0.119351 -0.152153 -0.178431 -0.108622 0.009949 -0.652321 0.161884 0.348952 0.144239 0.340095 -0.280025 -0.296650 -0.332025 -0.341752 0.282813 0.313215 0.276363 0.246192 0.253368 0.251354
chargesum: 0.00000
title: Mulliken charges with hydrogens summed into heavy atoms:
elementType: F F F O O N C C C C C C C C C
charge: -0.167093 -0.119351 -0.152153 -0.178431 -0.108622 0.009949 -0.056293 0.161884 0.348952 0.144239 0.340095 -0.003663 -0.050458 -0.078656 -0.090398
polarizability: 1.30392926e+02 6.01005874e+00 1.16991241e+02 -1.00657909e+01 1.92900954e+00 6.98984942e+01
1716.lowfreq: -8.4289 -3.9966 -1.6300 0.0011 0.0014 0.0014 26.0240 29.0763 43.6086
frequency: 25.9999 29.0687 43.5979 57.7379 106.3227 152.2287 181.3210 187.8628 224.6659 291.2923 348.7047 363.5244 371.4524 431.5839 435.9521 454.1377 493.3836 551.1584 591.0605 612.2212 657.1132 659.2643 731.2021 739.8305 795.7680 844.9133 891.9435 913.5046 959.4277 971.3840 976.5483 993.4020 997.6357 1035.9226 1060.5039 1073.8166 1091.3184 1154.5678 1184.8389 1219.8815 1271.5793 1299.8017 1304.6628 1328.1718 1400.5569 1420.2745 1462.9644 1546.7413 1575.2284 1606.6087 1668.7335 3002.7340 3063.1838 3138.3372 3145.7820 3160.1630 3174.3966
redmass: 14.6967 10.5241 4.3523 7.8519 10.5283 8.0041 7.6906 8.8523 5.1481 12.5523 4.7300 2.4998 13.7757 8.9191 5.7191 4.5767 10.8658 4.2092 6.5739 4.5881 7.9361 8.0704 5.5306 3.6130 2.3935 2.0334 1.2640 3.0696 6.9656 4.3283 1.7201 1.5280 4.3013 4.7395 2.0097 8.4394 1.6474 1.5254 3.6035 1.2846 2.8517 8.6158 1.8473 1.4318 1.8425 1.0972 1.9245 7.7025 5.4165 10.1657 10.7701 1.0595 1.0995 1.0878 1.0898 1.0970 1.0971
irintensity: 0.1169 0.1188 0.2269 2.7495 4.7906 1.6407 5.6831 13.6878 0.6037 0.6899 0.6366 0.0154 4.6072 3.8873 6.6393 0.9400 10.9143 7.8564 53.3588 7.7274 1.6788 2.7452 4.3922 1.4708 27.7831 36.3866 2.6889 3.4654 12.0686 137.3628 27.3309 20.2315 224.8455 16.2517 7.4295 191.7615 0.7132 22.1529 88.7086 1.9678 138.3873 1.0889 68.5362 16.8860 27.5490 55.5621 2.2132 40.2819 3.9017 124.7860 79.2880 3.6316 2.0484 6.6324 14.2271 11.7627 5.7905
temp: 298.150 k
press: 1.00000 atm
elementType: 9 9 9 8 8 7 6 6 6 6 6 6 6 6 6 1 1 1 1 1 1
symmnumber: 1
zpe: 355745.4 jmol-1
zpe.correction: 0.135496 hartree
zpe.thermalcorrener: 0.149007 hartree
zpe.thermalcorrenthalpy: 0.149951 hartree
zpe.thermalcorrgfe: 0.092493 hartree
zpe.sumelectzpe: -850.167687 hartree
zpe.sumelectthermal: -850.154176 hartree
zpe.sumelectthermalent: -850.153232 hartree
zpe.sumelectthermalfe: -850.210689 hartree
dipole: 0.0771 0.0799 -2.1873
dipole: 2.1901
quadrupole: -90.6488 -91.6550 -88.1363
quadrupole: -2.0734 -2.8701 0.1936
quadrupole: -0.5021 -1.5083 2.0104 -2.0734 -2.8701 0.1936
hfenergy: -850.3031828 hartree
pointgroup: C01 [X(C9H6F3N1O2)]
dipole: -0.1669985 0.8278726 0.1708147 debye
dipolederiv: -0.5327148 -0.10339 -0.0348343 -0.1526629 -0.3924988 -0.1489461 -0.1072162 -0.1908694 -0.6342545 -0.4441522 -0.2212193 0.1149094 -0.2448353 -0.7010577 0.1578214 0.1674039 0.2094864 -0.3511645 -0.736354 0.2188582 -0.0720378 0.2024026 -0.4251196 0.1055345 -0.0057659 0.0640526 -0.3596905 -0.6062011 -0.0214667 -0.0483198 0.0322831 -0.2896213 0.0912221 -0.1426774 0.1813516 -0.8910537 -0.3628704 0.0859178 0.0960395 -0.1145157 -0.6919096 -0.0300115 0.0762715 -0.087138 -0.3165653 -0.3066439 -0.0124593 -0.0197077 0.0250973 -0.2367756 0.0045974 -0.0701418 -0.004766 -0.2522166 -0.5302558 -0.0910083 0.2096624 -0.1590342 -0.3240812 0.1679776 0.3094719 0.3092839 -0.1858066 1.5142081 0.0791676 0.1704885 -0.0642277 0.1022255 -0.1104399 0.1221461 -0.2900276 1.0770592 -0.4466832 0.0219641 -0.2756342 0.0499871 0.0156275 0.0330187 -0.204046 0.0596886 -0.1231548 0.4150108 0.0227695 -0.3177356 0.3157768 1.0054784 -0.0836832 -0.3706037 -0.0962981 0.4200788 1.5952811 0.0960417 0.124552 0.1683093 1.4216505 -0.1245688 0.1728588 -0.0533911 1.1987461 -0.2239065 -0.01121 0.1706969 0.0508115 -0.0361183 -0.0077542 -0.1928072 -0.0053743 0.0196765 0.0063896 0.0146166 -0.1795906 -0.0352385 -0.0698326 0.0075604 0.0713193 -0.0249058 -0.1631897 0.4139723 -0.0192339 -0.2200856 -0.0453257 -0.0659728 0.0124794 0.0089526 0.0040651 -0.0027037 -0.036253 -0.0076994 0.1246457 -0.0260679 -0.0617243 -0.0496905 0.0157392 -0.0164408 0.4051348 0.088556 -0.0538092 0.0231543 -0.0184037 0.0775367 -0.0540671 0.0240505 -0.0907303 0.0242713 0.0728423 -0.0257487 -0.0255293 -0.0158112 0.1176934 -0.0017687 -0.0722063 0.0021058 0.0867767 0.13428 0.0066426 -0.0176348 -0.0044271 0.1488997 0.0106394 0.0401904 0.0086423 0.0070383 -0.033686 0.0124588 0.0724837 0.0236554 0.1335197 0.0069299 0.068238 0.0100573 0.08403 -0.0603087 0.0059027 0.0844152 0.0042656 0.1362609 -0.00137 0.064855 0.000281 0.0457465 0.0794894 0.0029051 0.0200622 0.0079611 0.1358195 0.0145193 0.0239673 0.010927 -0.0887584 unknown
polarizability: 133.60846|-0.1797466|69.0504952|2.3385207|-6.6558904|114.6237063 unknown
InChI: InChI=1S/C9H6F3NO2/c10-9(11,12)8(15)5-7(14)6-1-3-13-4-2-6/h1-4H,5H2
charge 0 multiplicity 1
21 atoms
F  -1.926125 -0.03029 2.020369
F  -2.921027 -1.940533 1.291488
F  -3.620656 0.070398 0.500683
O  0.461323 0.849663 -2.701443
O  -1.002787 -1.821404 -0.678299
N  3.913506 0.195996 0.996642
C  -1.050541 0.640872 -0.814517
C  0.348456 0.669718 -1.460737
C  1.55323 0.498603 -0.579173
C  -1.433585 -0.728727 -0.270682
C  -2.487913 -0.685423 0.886322
C  2.835295 0.443508 -1.186034
C  1.478382 0.399935 0.834272
C  3.973285 0.291429 -0.368064
C  2.675762 0.251816 1.571135
H  -1.145736 1.406466 -0.022567
H  -1.779995 0.902053 -1.605556
H  2.91975 0.517479 -2.27424
H  0.526803 0.443259 1.374373
H  4.976718 0.241383 -0.803774
H  2.653655 0.174197 2.663501
