program: Gaussian 09
title: 000238278
version: EM64L-G09RevD.01
frameworkgroup: C1[X(C15H22O2)]
method: RPBEPBE
basis: SDD
operation: Freq
keyword: #pfreq=noraman
keyword: PBEPBE/SDD
title: #p freq=noraman PBEPBE/SDD
converged: YES YES NO NO
title: Mulliken charges:
elementType: O O C C C C C C C C C C C C C C C H H H H H H H H H H H H H H H H H H H H H H
charge: -0.239454 -0.238302 0.365647 -0.414233 -0.416036 -0.385320 -0.441892 0.065929 -0.741418 -0.724360 -0.627480 0.490753 -0.380137 -0.395648 -0.234433 -0.232221 -0.244946 0.183297 0.235048 0.235114 0.186847 0.261487 0.192720 0.195857 0.210592 0.188687 0.224467 0.213571 0.222153 0.221585 0.229712 0.218455 0.219321 0.216820 0.242484 0.231938 0.220253 0.220134 0.223010
chargesum: 0.00000
title: Mulliken charges with hydrogens summed into heavy atoms:
elementType: O O C C C C C C C C C C C C C C C
charge: -0.239454 -0.238302 0.365647 0.004112 0.005925 0.068887 -0.035443 0.254616 -0.081228 -0.054609 -0.191339 0.490753 -0.137652 -0.163710 -0.014180 -0.012087 -0.021935
polarizability: 1.68729117e+02 1.84607012e+01 1.56980188e+02 6.17501223e+00 -2.84627563e+00 1.50002907e+02
1716.lowfreq: -11.1712 -7.1406 0.0003 0.0004 0.0007 4.6928 9.5165 29.7186 42.6508
frequency: 9.1537 29.4211 42.1549 64.9117 77.0882 101.3148 160.4867 185.4530 197.5749 215.7458 233.3288 246.4497 282.6724 291.0395 317.9728 341.3391 352.4979 393.8494 403.0501 447.7512 465.7209 498.1505 512.1881 516.8228 610.9146 618.0652 669.0381 701.8703 726.6759 751.0176 757.5865 775.6235 784.2568 793.8505 850.5009 889.4045 910.0706 921.2807 929.7545 941.7842 952.2164 967.1470 972.8814 989.1841 992.3895 993.2065 1004.7383 1024.3223 1028.6529 1052.4889 1065.3680 1073.8866 1081.1269 1085.8605 1165.8394 1170.5112 1176.7680 1187.8638 1189.3105 1207.6011 1216.8296 1232.4412 1260.8129 1281.3285 1302.3849 1319.8282 1321.9653 1330.6477 1341.7442 1351.1281 1354.3950 1357.7679 1370.5461 1384.7218 1389.7962 1392.4839 1440.9751 1450.5312 1457.1548 1457.3323 1466.7559 1474.2248 1480.8029 1485.0763 1486.2038 1488.4924 1492.5492 1594.9496 1616.3706 2864.1227 2913.1416 2923.4347 2960.8647 2977.2473 2982.1391 2986.6647 3010.1857 3012.1103 3044.3377 3069.2832 3070.6631 3071.0027 3072.8666 3078.6225 3078.7828 3080.9378 3117.7866 3125.3118 3138.5592 3148.1197 3161.7489
redmass: 3.6467 4.4331 3.5203 2.3705 2.4911 2.5610 2.7102 2.7629 4.4632 1.1794 2.8637 3.5018 1.9494 1.9675 2.0997 2.8822 2.0034 2.1721 2.8066 2.7240 3.3896 3.5394 4.7936 4.1944 4.3946 6.2366 3.6854 1.6396 2.6136 1.3237 3.2626 2.3820 1.3070 2.8125 1.2496 2.1684 1.8187 1.7343 2.2158 2.4970 6.3622 2.0268 1.4174 1.8832 3.0285 2.2052 1.5840 1.8853 2.1295 2.8455 1.7563 2.2321 2.8518 1.5923 2.1884 1.0566 1.8111 1.4632 1.1400 1.5672 2.1679 1.2134 1.4069 1.1708 1.5082 1.2081 1.5417 1.2976 1.3789 1.3674 1.3867 1.3873 1.3523 6.9400 1.2284 1.2036 2.1560 1.0801 1.1108 1.0843 1.0609 1.0751 1.0484 1.0548 2.3305 1.0479 1.0676 6.0931 6.1672 1.0822 1.0690 1.0693 1.0605 1.0366 1.0399 1.0606 1.0986 1.0604 1.0963 1.1015 1.0971 1.0982 1.0991 1.0958 1.0954 1.0989 1.0841 1.0877 1.0928 1.0963 1.1015
irintensity: 0.0280 0.1395 0.4573 0.0522 0.3318 0.9394 0.6539 1.3627 1.9670 0.3924 3.5566 1.8075 0.5054 0.9054 0.1123 2.6941 1.3771 1.6120 0.0202 0.3921 2.7881 6.6446 3.8014 11.7520 0.8755 0.0763 15.6109 69.5469 11.7671 6.6969 9.0350 18.1863 15.3304 45.8575 0.4910 6.5942 2.4008 9.9870 32.3934 4.4381 21.3434 17.5284 0.3372 2.9790 8.6967 34.6332 2.9853 7.4968 4.6818 3.1989 18.7242 9.8892 136.9264 19.3526 3.4214 0.1260 13.9222 4.0789 0.7108 5.7602 2.8999 6.4933 10.2076 2.6917 17.5341 0.9171 8.8955 3.3335 1.5936 3.7420 3.4580 25.9861 0.4507 0.5526 17.7541 16.3451 7.5534 6.5826 13.5222 5.6542 4.6253 24.9105 8.1384 13.0081 12.2867 8.9122 3.7647 0.5509 5.2324 92.2219 23.1943 131.8320 52.8733 30.8294 13.1247 33.2767 25.7814 37.2026 0.2295 10.0060 11.8125 27.5970 84.0309 56.6240 20.1032 35.2125 1.5978 2.2809 30.9690 41.6795 15.5578
temp: 298.150 k
press: 1.00000 atm
elementType: 8 8 6 6 6 6 6 6 6 6 6 6 6 6 6 6 6 1 1 1 1 1 1 1 1 1 1 1 1 1 1 1 1 1 1 1 1 1 1
symmnumber: 1
zpe: 884562.9 jmol-1
zpe.correction: 0.336912 hartree
zpe.thermalcorrener: 0.354038 hartree
zpe.thermalcorrenthalpy: 0.354982 hartree
zpe.thermalcorrgfe: 0.290082 hartree
zpe.sumelectzpe: -733.909054 hartree
zpe.sumelectthermal: -733.891928 hartree
zpe.sumelectthermalent: -733.890984 hartree
zpe.sumelectthermalfe: -733.955884 hartree
dipole: -2.7000 -0.5846 -0.1161
dipole: 2.7650
quadrupole: -100.1323 -97.9085 -101.9686
quadrupole: 3.5335 1.3951 0.3328
quadrupole: -0.1292 2.0946 -1.9655 3.5335 1.3951 0.3328
hfenergy: -734.245966 hartree
pointgroup: C01 [X(C15H22O2)]
dipole: 1.0644234 0.2210446 -0.0391283 debye
polarizability: 169.0453323|18.766542|156.100114|-4.9235564|3.198097|150.5667656 unknown
InChI: InChI=1S/C15H22O2/c1-3-15(4-2)11-16-14(17-12-15)10-13-8-6-5-7-9-13/h5-9,14H,3-4,10-12H2,1-2H3
charge 0 multiplicity 1
39 atoms
O  0.415759 0.89511 -1.35944
O  0.464796 1.187655 1.043129
C  2.356646 -0.034513 -0.064433
C  1.867955 0.631957 -1.381585
C  1.918058 0.92158 1.081767
C  1.682035 -1.423711 0.14403
C  3.911727 -0.106217 -0.120612
C  0.076249 1.769409 -0.237236
C  2.017084 -2.498265 -0.912643
C  4.597101 -0.759618 1.100901
C  -1.440595 2.000836 -0.234291
C  -2.268687 0.741553 -0.020266
C  -2.575664 -0.118438 -1.10586
C  -2.749242 0.404381 1.269934
C  -3.346572 -1.285664 -0.906702
C  -3.520248 -0.762528 1.473828
C  -3.823887 -1.611551 0.384496
H  2.411893 1.592865 -1.538547
H  2.033212 -0.015027 -2.257934
H  2.094752 0.481744 2.076511
H  2.471774 1.886554 1.004258
H  0.588202 -1.266921 0.172187
H  1.965824 -1.801157 1.146922
H  4.308854 0.923428 -0.246356
H  4.207936 -0.658293 -1.035282
H  0.634921 2.731401 -0.370082
H  1.682722 -2.199663 -1.923004
H  3.100401 -2.716187 -0.961372
H  1.499405 -3.443608 -0.667788
H  4.372479 -0.22043 2.039282
H  4.281376 -1.810028 1.231128
H  5.695006 -0.755146 0.972773
H  -1.691164 2.470716 -1.203094
H  -1.652189 2.739683 0.559652
H  -2.194824 0.124583 -2.103987
H  -2.506513 1.054054 2.118985
H  -3.575594 -1.939307 -1.756487
H  -3.88358 -1.008104 2.478478
H  -4.425312 -2.514832 0.53924
