program: Gaussian 09
title: 000242890
version: EM64L-G09RevD.01
frameworkgroup: C1[X(C13H10FNO)]
method: RPBEPBE
basis: SDD
operation: Freq
keyword: #p
keyword: freq=noraman
keyword: PBEPBE/SDD
title: #p freq=noraman PBEPBE/SDD
converged: YES YES NO NO
title: Mulliken charges:
elementType: F O N C C C C C C C C C C C C C H H H H H H H H H H
charge: -0.229016 -0.274819 -0.484770 0.051550 0.485474 0.161096 0.235873 -0.295844 -0.345490 -0.450661 -0.348901 -0.236855 -0.213830 -0.197321 -0.193958 -0.253960 0.347053 0.287304 0.308669 0.226294 0.259933 0.239191 0.226478 0.226360 0.241244 0.228909
chargesum: 0.00000
title: Mulliken charges with hydrogens summed into heavy atoms:
elementType: F O N C C C C C C C C C C C C C
charge: -0.229016 -0.274819 -0.137717 0.051550 0.485474 0.161096 0.235873 -0.008541 -0.036822 -0.224367 -0.088968 0.002336 0.012648 0.029039 0.047286 -0.025051
polarizability: 2.66577923e+02 7.06519697e+00 1.54114655e+02 9.57480983e-03 -4.51687187e-02 5.75928620e+01
1716.lowfreq: -9.1452 -6.0555 -2.6113 -0.0003 0.0005 0.0008 32.9072 44.6015 87.0264
frequency: 32.8876 44.5596 87.0131 90.9512 137.1613 212.2687 233.0068 262.5271 275.8270 348.6740 354.8737 407.0862 436.0748 501.7443 502.8812 516.2024 524.5303 573.9422 614.7902 650.2137 665.3499 694.5699 721.0083 751.0735 774.6825 775.6148 777.3342 820.3281 845.8758 870.1205 874.4376 921.5158 966.4223 974.8576 984.5181 1000.6159 1003.6403 1023.3235 1029.2313 1061.2691 1088.9097 1114.0091 1152.4453 1170.3270 1172.7186 1188.6325 1224.3966 1267.2692 1273.3523 1323.2073 1381.0927 1387.1794 1431.2965 1435.4947 1461.1076 1485.8641 1535.1451 1567.1750 1597.3755 1611.3370 1616.1807 1626.6220 3113.6234 3131.7765 3144.4921 3144.6709 3156.9566 3164.9646 3169.5058 3182.2276 3197.7082 3489.2459
redmass: 5.8268 4.7606 6.0400 5.6902 5.1738 6.7478 5.2723 6.6291 4.5738 7.2402 10.7688 2.9186 3.5216 7.5795 3.3848 8.7015 3.3291 6.8895 6.4685 6.5039 4.3980 1.7873 1.4080 2.7914 1.4585 7.0785 1.5747 5.7000 1.2636 7.1386 1.4061 1.4403 1.3498 1.3532 6.1802 1.3095 1.3304 2.4772 2.0921 3.8919 1.6236 1.9244 2.0837 1.1819 1.0764 1.1170 2.3349 1.7781 2.2371 1.4632 8.2707 7.0012 2.4533 2.4797 2.5105 2.4509 2.3568 5.8703 7.5675 5.8379 4.5040 4.0296 1.0883 1.0869 1.0863 1.0935 1.0906 1.1000 1.0956 1.0997 1.0950 1.0773
irintensity: 2.7383 0.8862 3.9161 0.9223 0.2673 7.0956 0.9712 4.7201 1.0796 4.0088 1.6155 0.0256 0.6642 7.7399 25.4657 18.0698 5.8038 11.4169 1.0720 2.1095 4.4547 27.2769 23.8256 24.0570 222.9202 12.1585 0.1644 1.9654 1.4635 13.6305 0.0958 16.1303 3.0414 0.0823 0.0885 2.9372 1.0933 0.1267 23.1294 32.6074 12.2801 13.8734 10.2586 6.7062 1.6898 0.4894 16.2399 39.8204 52.5981 50.2715 1.2649 46.1504 2.1066 105.4851 21.7690 80.5810 378.7967 13.4945 120.1383 83.7441 12.0427 21.6099 10.9264 0.5999 3.7852 29.8122 2.2236 30.9040 12.2983 12.0752 7.6620 71.5149
temp: 298.150 k
press: 1.00000 atm
elementType: 9 8 7 6 6 6 6 6 6 6 6 6 6 6 6 6 1 1 1 1 1 1 1 1 1 1
symmnumber: 1
zpe: 516483.6 jmol-1
zpe.correction: 0.196718 hartree
zpe.thermalcorrener: 0.209573 hartree
zpe.thermalcorrenthalpy: 0.210517 hartree
zpe.thermalcorrgfe: 0.156121 hartree
zpe.sumelectzpe: -730.112444 hartree
zpe.sumelectthermal: -730.099589 hartree
zpe.sumelectthermalent: -730.098645 hartree
zpe.sumelectthermalfe: -730.153041 hartree
dipole: -2.2802 2.1374 0.0056
dipole: 3.1253
quadrupole: -67.0214 -89.4523 -98.0113
quadrupole: 1.3115 0.0017 -0.0317
quadrupole: 17.8069 -4.6240 -13.1830 1.3115 0.0017 -0.0317
hfenergy: -730.3091621 hartree
pointgroup: C01 [X(C13H10F1N1O1)]
dipole: -0.8810798 -0.856853 0.0376153 debye
dipolederiv: -0.6157742 0.3208533 -0.0004285 0.2541207 -0.6855137 0.0100899 0.0010309 0.0088635 -0.1469935 -0.716032 -0.1621059 0.010648 0.3950364 -0.9132194 0.0079798 -0.005016 0.0182919 -0.3550932 -1.6648319 0.2537579 0.0178115 0.4744889 -0.4880429 -0.0030096 0.0103156 0.0014305 -0.3012026 -0.3895206 -0.1275213 0.0095077 -0.1348139 -0.2341651 0.0080779 0.0102642 0.0078626 -0.0265336 1.1501709 -0.0686107 -0.0179379 0.1452374 0.0352485 -0.0010427 -0.0235163 0.0029412 0.1021053 1.8060038 0.03579 -0.0283243 -0.7776356 1.1703675 -0.0118326 -0.0045913 -0.026884 0.2342807 0.5544916 -0.3519717 0.0014454 -0.1366949 0.7199168 -0.0148698 -0.0040286 -0.0112196 0.0770096 0.0272953 0.0906613 -0.004218 -0.0897628 0.0282145 -0.0015317 0.0006123 -0.0048575 -0.0929471 -0.2707411 -0.0069022 0.0021972 -0.1240641 -0.0693033 -0.0007339 0.0059341 -0.0028674 -0.1646183 -0.2344771 0.0308844 -0.0005988 0.1180656 0.0144585 -0.0092657 -0.003185 -0.007506 -0.2066747 -0.2705062 0.1329441 -0.001304 0.0306955 -0.029146 -0.0035389 0.0011961 -0.0052495 -0.1454227 -0.0520041 -0.1861309 0.0030677 -0.215058 -0.0136078 -0.0002441 0.0038005 -0.0008482 -0.1635074 0.0571501 0.0405353 -0.0052843 0.1415113 0.1446413 -0.0118225 -0.0087515 -0.009866 -0.1459086 0.0363399 -0.0204198 -0.0028626 -0.1474586 0.1260617 -0.0055817 0.0014427 -0.008158 -0.1424736 0.0725538 0.0112658 -0.0037358 0.0292429 0.0942718 -0.0065201 -0.0044084 -0.0062449 -0.1381936 -0.0380087 0.0219573 -0.0035681 0.0266417 -0.1314564 -0.0020652 -0.0037458 -0.0018694 -0.1826574 0.3264583 0.0617739 -0.0018612 0.0658841 0.1818063 0.0024062 -0.002062 0.002314 0.3070521 0.189871 -0.0470616 0.0004923 -0.012029 0.0353345 0.0032722 -0.0004277 0.0040412 0.153785 0.170865 0.0578981 -0.0015615 0.0350657 0.0591669 0.0033124 -0.0010398 0.0027436 0.1816493 0.0234629 -0.113875 0.0063565 -0.0941409 -0.0427037 0.008451 0.0057127 0.008793 0.1673766 0.0782871 -0.0263275 0.0024552 -0.0446309 -0.0281202 0.0062748 0.0028175 0.0060138 0.1826792 -0.0219546 0.0859488 0.0009337 0.1069686 -0.0085407 0.0027398 0.0002573 0.0031433 0.165951 0.0182995 -0.0750433 0.0049708 -0.1125847 -0.0734746 0.0093063 0.0062727 0.0086164 0.1528089 0.0076732 0.0901898 0.0000383 0.1186979 -0.0685755 0.0048197 -0.0009129 0.0053576 0.1577287 -0.0977899 -0.0409826 0.0054192 -0.0455989 0.0854204 0.0027431 0.0056175 0.0026379 0.1610051 -0.1472821 -0.0075077 0.0063414 -0.0071845 0.0909608 0.0025853 0.006411 0.0025197 0.1687948 unknown
polarizability: 266.7351473|-5.0567073|153.8167746|-3.6318244|-2.6432102|57.7335181 unknown
InChI: InChI=1S/C13H10FNO/c14-12-9-5-4-8-11(12)13(16)15-10-6-2-1-3-7-10/h1-9,15H
charge 0 multiplicity 1
26 atoms
F  -1.387917 -2.140295 0.164872
O  -0.105653 1.987395 0.030788
N  0.594293 -0.251817 0.081481
C  -1.817486 0.283548 0.108339
C  2.009912 -0.105998 0.049935
C  -0.372378 0.745209 0.070255
C  -2.305737 -1.04269 0.151108
C  -2.805626 1.306405 0.098405
C  2.67204 1.150832 -0.002148
C  2.776515 -1.304624 0.072429
C  -3.665759 -1.380771 0.182473
C  -4.181568 1.009591 0.129022
C  4.083195 1.185888 -0.030573
C  4.183574 -1.250858 0.043438
C  -4.616827 -0.336821 0.171038
C  4.848075 -0.002573 -0.008238
H  0.249064 -1.216234 0.114267
H  -2.437106 2.336927 0.064977
H  2.080522 2.067327 -0.019808
H  2.26697 -2.276174 0.112788
H  -3.960343 -2.433447 0.214874
H  -4.913969 1.822766 0.119911
H  4.587596 2.15792 -0.071087
H  4.760041 -2.182327 0.06146
H  -5.684588 -0.57701 0.195156
H  5.942156 0.040833 -0.030857
