program: Gaussian 09
title: 000242880
version: EM64L-G09RevD.01
frameworkgroup: C1[X(C13H8FNS)]
method: RPBEPBE
basis: SDD
operation: Freq
keyword: #p
keyword: freq=noraman
keyword: PBEPBE/SDD
title: #p freq=noraman PBEPBE/SDD
converged: YES YES NO NO
title: Mulliken charges:
elementType: S F N C C C C C C C C C C C C C H H H H H H H H
charge: 0.229653 -0.202642 -0.026372 -0.308833 0.345920 -0.349225 0.504623 -0.446414 -0.311603 -0.377841 -0.356252 0.341707 -0.366924 -0.219673 -0.230933 -0.234431 0.274872 0.265525 0.275303 0.233806 0.261063 0.232839 0.231579 0.234253
chargesum: 0.00000
title: Mulliken charges with hydrogens summed into heavy atoms:
elementType: S F N C C C C C C C C C C C C C
charge: 0.229653 -0.202642 -0.026372 -0.308833 0.345920 -0.349225 0.504623 -0.171543 -0.046079 -0.102538 -0.122445 0.341707 -0.105861 0.013167 0.000646 -0.000178
polarizability: 3.18436268e+02 7.65661937e+00 1.61571427e+02 -1.17995353e-03 -1.11324980e-02 5.97912562e+01
1716.lowfreq: -4.4021 -2.9394 -0.0020 -0.0010 0.0017 5.4547 37.5013 49.7426 93.5000
frequency: 37.4934 49.7350 93.5000 136.0749 190.9917 231.5374 243.4538 266.7776 342.6181 368.3877 398.0891 410.2107 433.3893 477.5378 480.5538 512.2187 575.8355 608.5070 614.6816 636.3888 640.3701 683.8968 692.6517 730.1437 779.2161 787.2635 815.4454 850.3791 852.7649 868.8653 914.6938 935.6940 948.7327 984.8297 988.0708 1004.0610 1025.9426 1030.0885 1086.9924 1111.4019 1165.6849 1174.4523 1189.1696 1196.1333 1244.7278 1287.0155 1321.9038 1369.2035 1383.4858 1411.4542 1436.6949 1449.7983 1471.8162 1533.5535 1568.6780 1583.4577 1606.7791 1616.5740 3125.8586 3134.4434 3147.9514 3162.6741 3168.2413 3173.1072 3182.1502 3187.8791
redmass: 4.2450 8.7021 6.2273 6.6633 5.8700 6.7743 7.7989 8.2598 9.3456 6.3387 2.8017 8.3556 3.0212 4.6003 10.2385 7.2712 3.9354 6.7629 4.8650 8.4349 7.3738 7.6869 1.7625 4.2668 1.8407 6.8585 1.4641 1.2577 1.4619 7.3858 7.2866 1.4369 1.3429 1.3818 6.2164 1.3353 2.2157 2.4694 1.5995 1.3384 2.5968 1.0619 1.4511 2.3515 1.5076 4.0442 1.3324 4.4828 7.6476 4.8625 2.3766 3.8066 2.4048 8.4388 7.2564 6.0624 6.4742 7.1620 1.0868 1.0876 1.0927 1.0964 1.0888 1.1000 1.0936 1.0978
irintensity: 0.0009 0.2584 0.1895 1.6163 1.2877 1.2736 1.7381 0.2961 6.4448 0.0762 0.0156 2.5707 6.6215 5.2138 11.2543 0.5027 13.1813 8.7599 1.3627 32.9107 0.7552 9.2948 53.2784 0.0084 56.6368 46.0773 37.4398 0.0025 47.9985 36.9241 27.5703 4.7498 0.3233 0.4006 0.3764 0.5071 3.0591 6.2787 11.8602 7.5812 73.2443 0.1608 12.1559 3.5522 24.8570 29.8804 2.7151 36.0624 0.5322 7.7531 25.8714 63.0996 34.4370 20.8389 44.9546 8.1445 23.7693 48.1736 7.4257 1.4228 20.0923 19.8064 1.3568 21.2915 0.8641 4.1812
temp: 298.150 k
press: 1.00000 atm
elementType: 16 9 7 6 6 6 6 6 6 6 6 6 6 6 6 6 1 1 1 1 1 1 1 1
symmnumber: 1
zpe: 449391.4 jmol-1
zpe.correction: 0.171164 hartree
zpe.thermalcorrener: 0.183520 hartree
zpe.thermalcorrenthalpy: 0.184464 hartree
zpe.thermalcorrgfe: 0.131387 hartree
zpe.sumelectzpe: -1051.765565 hartree
zpe.sumelectthermal: -1051.753209 hartree
zpe.sumelectthermalent: -1051.752265 hartree
zpe.sumelectthermalfe: -1051.805342 hartree
dipole: -2.4696 0.1058 0.0011
dipole: 2.4719
quadrupole: -91.8645 -88.6685 -104.3547
quadrupole: 4.2288 -0.0018 -0.0093
quadrupole: 3.0980 6.2941 -9.3921 4.2288 -0.0018 -0.0093
hfenergy: -1051.9367289 hartree
pointgroup: C01 [X(C13H8F1N1S1)]
dipole: -0.9714809 -0.0448755 0.0029524 debye
dipolederiv: -0.372793 -0.084997 0.0045151 -0.2158313 -0.4142231 0.0218135 0.0103368 0.0219205 0.0624638 -1.3774081 -0.1833987 0.0101126 -0.366032 -0.2683887 0.0059527 0.0184939 0.0056977 -0.1485878 -0.4666032 0.2104286 -0.0091464 0.1422747 -0.7069463 0.0236915 -0.0058136 0.0232712 -0.1788247 0.3385118 -0.1603163 0.0065864 -0.2298973 0.0586703 -0.0057707 0.0097894 -0.0058797 -0.0765873 0.100005 -0.0970384 0.0043933 0.1143434 -0.0584209 0.0050556 -0.0056598 0.0054902 0.0572463 0.8963597 0.1741457 -0.0091688 0.4718366 0.9118397 -0.0429656 -0.0215316 -0.0426903 -0.026317 -0.0980227 -0.0112215 0.0007097 -0.1635097 -0.0932651 0.0061482 0.0068651 0.0060552 0.037554 -0.3249725 0.0489452 -0.0019457 0.2384539 -0.0375954 -0.00437 -0.0103732 -0.0041197 -0.1253012 0.3082229 -0.0099918 -0.0002922 -0.0375388 0.1116309 -0.0107952 0.0009218 -0.0108523 -0.1292899 -0.0900837 -0.0973531 0.0046108 0.0884392 0.0146621 -0.0066272 -0.0039823 -0.0063409 -0.1234156 0.0098491 0.0782719 -0.0038646 -0.0092173 -0.001703 -0.0067746 -0.0000919 -0.006824 -0.1446857 1.3470805 0.1873254 -0.0103614 0.4665948 0.4326858 -0.01638 -0.023053 -0.0159585 0.0846592 -0.3282757 -0.0592452 0.002881 -0.4211932 -0.1194612 -0.0016342 0.0192245 -0.0022211 -0.1702953 -0.0623551 0.1323919 -0.0062722 0.1819283 0.0905267 -0.0113262 -0.0086248 -0.0112556 -0.146495 -0.0995383 -0.1250193 0.005869 -0.2754563 0.0749991 -0.0100307 0.0130822 -0.0102675 -0.1455684 0.0142371 0.0039563 -0.0002815 0.0446619 -0.0149127 -0.0063813 -0.0022688 -0.0063467 -0.1505584 0.0879762 0.0026393 0.0000354 -0.0454617 0.0125521 0.0080353 0.0022369 0.0079847 0.1884424 0.088299 -0.0498895 0.0023872 -0.0063645 -0.0235939 0.0085881 0.000424 0.0086752 0.1669261 0.1002464 0.0851437 -0.0039686 0.059869 0.0205576 0.0062549 -0.0028712 0.0061585 0.1545731 0.0620667 -0.1059892 0.0050175 -0.1050723 -0.0129662 0.0079384 0.0050375 0.0078824 0.1526696 -0.0046581 0.0691288 -0.0028059 0.0714339 0.0515019 0.0058617 -0.002917 0.0058732 0.1843586 0.0075796 -0.0800002 0.0039097 -0.1150288 -0.0670193 0.0106193 0.0055456 0.0105957 0.1567538 0.0029795 0.0792296 -0.0035463 0.1200543 -0.0563142 0.0099645 -0.0054755 0.0100452 0.1585562 -0.1387031 -0.0071463 0.0006261 -0.0092867 0.0951838 0.0031318 0.0007048 0.0031065 0.1617232 unknown
polarizability: 318.4863864|-7.1280373|161.3098735|-0.0338373|-4.6275375|60.0026911 unknown
InChI: InChI=1S/C13H8FNS/c14-10-6-7-11-12(8-10)16-13(15-11)9-4-2-1-3-5-9/h1-8H
charge 0 multiplicity 1
24 atoms
S  0.236135 1.710969 -0.094079
F  5.424129 0.639759 -0.053814
N  0.075299 -0.983553 0.027639
C  1.749275 0.732271 -0.052096
C  1.44207 -0.67059 0.011595
C  -0.702998 0.080601 -0.018629
C  -2.16955 0.069887 -0.016496
C  3.078189 1.196518 -0.075143
C  2.492895 -1.619417 0.052454
C  -2.846041 -1.182731 0.042507
C  -2.933721 1.2671 -0.071799
C  4.081282 0.213546 -0.032452
C  3.827441 -1.175058 0.030303
C  -4.253126 -1.228932 0.046015
C  -4.342606 1.214628 -0.068022
C  -5.008222 -0.032199 -0.009183
H  3.343973 2.255016 -0.12343
H  2.248816 -2.683832 0.100655
H  -2.247654 -2.097876 0.08472
H  -2.42994 2.240058 -0.118004
H  4.666624 -1.874978 0.060347
H  -4.764405 -2.196627 0.0918
H  -4.92108 2.143631 -0.111027
H  -6.102984 -0.071191 -0.006362
