program: Gaussian 09
title: 000242850
version: EM64L-G09RevD.01
frameworkgroup: C1[X(C12H8F3N)]
method: RPBEPBE
basis: SDD
operation: Freq
keyword: #p
keyword: freq=noraman
keyword: PBEPBE/SDD
title: #p freq=noraman PBEPBE/SDD
converged: YES YES NO NO
title: Mulliken charges:
elementType: F F F N C C C C C C C C C C C C H H H H H H H H
charge: -0.216068 -0.204878 -0.206104 -0.507442 0.343653 0.477057 0.104577 -0.503169 -0.407569 -0.342832 0.349763 -0.282192 -0.341912 -0.368409 -0.380648 0.314349 0.327347 0.294298 0.241608 0.269203 0.259714 0.257815 0.258356 0.263481
chargesum: 0.00000
title: Mulliken charges with hydrogens summed into heavy atoms:
elementType: F F F N C C C C C C C C C C C C
charge: -0.216068 -0.204878 -0.206104 -0.180095 0.343653 0.477057 0.104577 -0.208871 -0.165961 -0.073629 0.349763 -0.022477 -0.084096 -0.110053 -0.117167 0.314349
polarizability: 2.35077997e+02 2.92860285e+00 1.33752474e+02 7.33468927e+00 1.06465362e+01 6.61522444e+01
1716.lowfreq: -7.3787 -1.6724 -0.0006 -0.0005 0.0005 4.9484 38.1670 43.3498 75.5703
frequency: 38.1321 43.3399 75.5606 140.5839 152.2602 206.3228 217.3784 262.7386 343.3722 353.4360 362.8161 394.2933 413.7243 432.7873 442.7747 452.6684 500.8695 546.3052 558.4046 587.3293 603.2444 635.8088 679.3412 692.4690 704.9928 765.2769 781.9494 783.0725 804.6939 823.7795 846.6418 856.5613 903.8457 932.1039 949.6334 967.9388 998.8503 1080.9609 1110.6855 1140.1828 1146.9384 1157.3003 1199.0453 1231.3907 1251.3480 1293.6436 1310.8190 1365.1414 1394.7580 1415.0049 1448.2108 1477.5293 1497.7513 1531.1806 1593.9602 1604.1332 1621.0780 1639.2530 3136.8845 3162.1823 3174.6142 3177.4984 3181.7637 3195.1494 3197.9433 3536.5682
redmass: 5.2188 6.2281 6.3522 9.1414 9.3997 7.6990 7.8335 6.9575 7.7785 8.2659 6.9072 4.9671 3.0689 8.9099 3.2654 7.0110 2.5881 6.4110 1.3788 4.7765 3.6699 7.0862 6.7369 3.9342 4.1403 5.1623 1.4866 4.4576 1.3442 1.7759 3.5835 1.5980 1.3211 1.3475 1.3335 3.1900 2.7889 2.2522 1.2947 2.0289 1.8711 1.4372 1.9130 2.1111 2.2120 1.3492 2.3452 4.5908 7.6771 4.4385 4.4743 2.3837 2.4975 3.1111 6.2283 5.1244 6.5651 7.2057 1.0902 1.0885 1.0897 1.0957 1.0972 1.0927 1.0970 1.0753
irintensity: 0.5159 0.2759 0.4886 2.3512 1.1843 2.9015 0.8444 2.4419 1.5288 3.5511 8.2216 2.6327 1.5519 4.5038 16.6617 5.3190 36.9696 10.7709 74.5967 10.8180 37.7750 0.6217 21.7290 5.7640 10.7421 25.7558 38.4909 0.1722 5.2917 123.8551 25.0736 12.8315 0.7073 0.3686 2.9876 45.1473 4.6249 23.6922 20.5004 66.1878 28.8427 33.6054 91.4479 1.2592 3.0560 0.1823 21.8927 36.1415 31.8927 3.6341 41.2837 50.8128 232.8556 493.9835 22.1175 4.2818 66.1475 258.9975 9.8048 7.6130 2.1931 4.5604 0.5478 0.1043 0.0417 47.0644
temp: 298.150 k
press: 1.00000 atm
elementType: 9 9 9 7 6 6 6 6 6 6 6 6 6 6 6 6 1 1 1 1 1 1 1 1
symmnumber: 1
zpe: 445777.7 jmol-1
zpe.correction: 0.169788 hartree
zpe.thermalcorrener: 0.182869 hartree
zpe.thermalcorrenthalpy: 0.183813 hartree
zpe.thermalcorrgfe: 0.129102 hartree
zpe.sumelectzpe: -815.237775 hartree
zpe.sumelectthermal: -815.224694 hartree
zpe.sumelectthermalent: -815.223750 hartree
zpe.sumelectthermalfe: -815.278461 hartree
dipole: 1.0554 -1.8757 -0.0617
dipole: 2.1531
quadrupole: -95.1896 -91.9687 -92.2590
quadrupole: 1.5450 2.8529 5.3824
quadrupole: -2.0505 1.1704 0.8801 1.5450 2.8529 5.3824
hfenergy: -815.4075632 hartree
pointgroup: C01 [X(C12H8F3N1)]
dipole: 0.4137621 0.7318751 0.1036143 debye
dipolederiv: -0.2216942 0.08171 0.0033879 -0.0514491 -0.9793416 0.0231445 0.0049796 0.0041518 -0.1305124 -0.2630187 0.0911433 0.0060796 0.3029445 -1.0335751 0.0288051 -0.0173374 0.0282725 -0.1501325 -1.2493049 -0.268283 -0.0349269 -0.3848762 -0.278499 -0.045171 -0.0440282 -0.0370323 -0.1669666 -2.1869533 0.129986 0.0370228 0.1458868 -0.3002823 0.0023846 0.1391652 0.0150348 -0.3496746 1.7321708 -0.4398726 -0.0549163 -0.8096243 0.1452257 -0.0169233 -0.3558771 -0.0107267 0.1156209 1.5864604 0.1876256 0.0276809 0.7557928 0.0170239 -0.0182756 -0.0092185 -0.0326006 0.0832702 -0.4406719 0.1226885 0.0003801 -0.0907602 1.0085781 -0.0119892 -0.0125476 0.0018953 -0.013299 -0.3795082 0.08506 -0.003886 0.4800278 -0.2458796 -0.0216599 0.0386576 -0.0336978 -0.1935766 -0.3434375 -0.0838189 -0.0859027 0.1669914 -0.0050759 0.1196472 0.0797661 0.1452365 -0.0912098 -0.1852651 0.0854679 0.0187684 -0.364425 -0.0774365 0.0987594 -0.171372 0.0751697 -0.0731354 0.5404899 -0.0093209 -0.0490306 -0.4070052 1.190668 -0.031772 -0.0062275 -0.0311455 0.1037803 0.2257661 -0.0262301 -0.0117993 -0.2152004 0.0921163 -0.001468 -0.025037 -0.0080888 -0.1055702 -0.0389214 0.0447394 0.0235195 -0.1305368 -0.0561606 0.08301 -0.1609057 0.0611634 -0.0696019 -0.0906236 -0.0905941 -0.0811771 0.1216452 -0.0147298 0.0748635 0.1062364 0.1036178 -0.070354 -0.2755137 -0.1540047 0.0011289 0.232167 -0.3165915 0.0085612 -0.0087366 0.030667 -0.2165372 1.1755271 0.3259908 0.0416541 0.384616 0.2213498 0.0487615 0.0427188 0.0335067 0.072177 0.1247722 0.0132706 0.0094373 -0.0203061 0.2131017 -0.0277999 0.1804334 -0.0324502 0.3125704 0.0612354 -0.0622656 0.0170421 -0.0812751 0.0680632 0.0109463 0.0352897 -0.0000175 0.1716503 0.0807206 -0.0708999 -0.0271312 -0.0574977 0.0122999 -0.1096569 -0.012739 -0.1073412 0.082025 0.0301347 0.040892 0.0734446 0.0519396 0.0814387 -0.0556031 0.10163 -0.0477071 0.091212 0.0297015 -0.0683862 0.0160784 -0.0715575 0.0424455 0.0097484 0.0192303 0.0062669 0.1759224 0.0056832 0.0402199 0.0612822 0.0410954 0.0995719 -0.0675526 0.0761637 -0.0608696 0.1201182 0.0794974 -0.0259037 -0.0069703 -0.045439 0.0412281 -0.0994681 -0.0310567 -0.0929332 0.1078477 0.0027531 0.0507854 0.0188336 0.0468459 0.0744613 -0.001292 0.0308126 -0.0103718 0.1943758 unknown
polarizability: 234.8318174|-1.3614763|130.3770555|-10.1237195|18.1344953|69.7738426 unknown
InChI: InChI=1S/C12H8F3N/c13-8-1-4-10(5-2-8)16-12-7-9(14)3-6-11(12)15/h1-7,16H
charge 0 multiplicity 1
24 atoms
F  2.226216 2.66879 -0.059507
F  2.958544 -2.845802 0.040636
F  -5.240131 -0.866386 -0.118332
N  0.034209 1.094784 0.202801
C  1.269269 0.452121 0.070493
C  -1.271471 0.54618 0.121647
C  2.4339 1.263325 -0.059068
C  1.478316 -0.953855 0.112865
C  -2.318075 1.204795 0.826095
C  -1.584324 -0.587174 -0.679009
C  2.788325 -1.446702 -0.003298
C  3.731239 0.761191 -0.164743
C  -3.647502 0.745569 0.741466
C  -2.909657 -1.064082 -0.754395
C  3.929678 -0.640809 -0.147724
C  -3.91498 -0.390643 -0.041267
H  0.092502 2.101926 0.368414
H  0.655486 -1.652581 0.271856
H  -2.086154 2.074732 1.451012
H  -0.809419 -1.073338 -1.276891
H  4.571128 1.453897 -0.264366
H  -4.457949 1.245523 1.279201
H  -3.16289 -1.932418 -1.36937
H  4.922439 -1.085944 -0.238918
