program: Gaussian 09
title: 000242835
version: EM64L-G09RevD.01
frameworkgroup: C1[X(C11H11FO)]
method: RPBEPBE
basis: SDD
operation: Freq
keyword: #p
keyword: freq=noraman
keyword: PBEPBE/SDD
title: #p freq=noraman PBEPBE/SDD
converged: YES YES NO NO
title: Mulliken charges:
elementType: F O C C C C C C C C C C C H H H H H H H H H H H
charge: -0.202116 -0.215141 -0.136086 -0.432309 -0.572158 0.406731 0.060210 0.129173 -0.722604 -0.377478 -0.506134 -0.372937 0.332629 0.230155 0.212831 0.218662 0.226006 0.233111 0.211014 0.216709 0.251193 0.242590 0.306349 0.259600
chargesum: 0.00000
title: Mulliken charges with hydrogens summed into heavy atoms:
elementType: F O C C C C C C C C C C C
charge: -0.202116 -0.215141 0.094068 -0.000815 -0.113041 0.406731 0.060210 0.129173 -0.043689 -0.134888 -0.199785 -0.113337 0.332629
polarizability: 1.57048295e+02 -5.46997249e+00 1.28419692e+02 -1.97844369e+00 -1.20917209e+00 6.53056984e+01
1716.lowfreq: -5.2496 -0.0005 -0.0003 0.0007 3.0343 15.6423 48.1410 105.0462 146.9838
frequency: 47.9319 105.0415 146.9818 177.2070 194.5879 220.0078 288.6244 304.3600 357.8744 365.8928 387.8331 428.2038 441.4638 481.6843 536.7031 541.3608 612.9177 671.1839 696.5583 716.5608 759.5050 815.0712 835.5381 873.5755 912.5380 922.1790 943.0405 960.2793 993.6747 1031.0032 1066.5543 1083.4407 1120.0199 1134.3145 1146.6574 1177.9074 1201.8998 1217.8562 1233.3655 1255.4779 1275.7712 1309.0260 1324.6307 1357.0359 1388.1141 1390.8269 1413.0794 1453.2572 1465.8539 1470.6169 1479.0113 1482.4964 1576.5864 1591.8533 1619.0613 2920.4328 2955.5878 2986.1225 2990.4149 3033.2902 3049.1993 3081.5131 3106.6030 3134.8209 3169.6332 3174.7834
redmass: 4.7300 3.8807 3.7135 1.1743 3.5820 2.8746 3.5298 3.2123 3.4327 5.4176 6.2430 5.1414 3.0016 5.0136 4.1165 3.4766 3.6099 5.0898 3.9975 4.4270 3.1043 1.8448 1.6973 3.4834 1.8299 1.4423 1.3113 1.3492 3.0438 1.7853 2.1957 2.0064 1.4552 1.5207 2.2041 1.6319 2.4426 1.3884 3.2884 1.3699 1.3515 1.7547 1.5797 1.6576 1.2341 6.4803 4.1706 1.1575 1.0568 1.0881 1.1261 2.2401 8.8865 8.8280 7.5804 1.0799 1.0665 1.0588 1.0389 1.0929 1.1029 1.0999 1.0990 1.0899 1.0924 1.0958
irintensity: 1.4198 0.1329 0.4028 0.0116 0.3789 0.1310 4.4896 1.3496 3.5894 6.0101 7.6963 1.5681 4.1179 1.1946 11.2273 2.3510 1.6861 1.2101 10.1083 15.9295 7.4575 22.6482 23.2232 39.0012 4.3327 25.5497 3.1621 3.0625 3.2146 4.0259 0.8532 1.1124 4.0876 0.7150 29.3764 0.9807 6.1015 2.9318 140.7573 32.4117 7.2372 8.4436 5.7075 14.3728 23.9280 5.2976 66.3677 25.1981 9.7720 12.3267 0.4979 90.8887 127.8594 30.0044 6.7513 15.2296 19.4347 19.3239 50.4136 33.0984 34.0694 39.2279 14.7748 11.3114 5.9808 5.4260
temp: 298.150 k
press: 1.00000 atm
elementType: 9 8 6 6 6 6 6 6 6 6 6 6 6 1 1 1 1 1 1 1 1 1 1 1
symmnumber: 1
zpe: 500077.9 jmol-1
zpe.correction: 0.190470 hartree
zpe.thermalcorrener: 0.201618 hartree
zpe.thermalcorrenthalpy: 0.202562 hartree
zpe.thermalcorrgfe: 0.153474 hartree
zpe.sumelectzpe: -599.907870 hartree
zpe.sumelectthermal: -599.896721 hartree
zpe.sumelectthermalent: -599.895777 hartree
zpe.sumelectthermalfe: -599.944865 hartree
dipole: 1.4034 4.7679 -0.3278
dipole: 4.9810
quadrupole: -76.4750 -77.7902 -76.0749
quadrupole: -0.8990 -0.5993 -0.0486
quadrupole: 0.3051 -1.0102 0.7051 -0.8990 -0.5993 -0.0486
hfenergy: -600.0983392 hartree
pointgroup: C01 [X(C11H11F1O1)]
dipole: -0.5331964 1.8809573 0.1341194 debye
dipolederiv: -0.9403061 0.3980336 0.0277324 0.5016896 -0.4611843 -0.0185689 0.0310084 -0.0182344 -0.1529918 -0.6705177 -0.0716977 -0.000585 -0.280552 -0.9451944 -0.0131061 0.015574 -0.0396749 -0.3060072 -0.197442 0.1190033 0.0200543 0.1566558 -0.0927265 -0.0288681 0.0873432 -0.0514205 0.1460851 0.0347727 -0.0581718 -0.0121347 -0.0666977 0.0346257 0.0150255 0.0165494 0.0015241 0.1367819 -0.0076391 0.0275756 -0.0185568 0.0064808 0.042135 -0.0156483 0.039004 -0.0805094 0.1504917 0.1981361 -0.2352397 -0.0346287 -0.0225334 0.045992 0.0003868 -0.0836069 0.0544125 -0.0329643 1.3885225 0.2237511 -0.0573757 0.257782 0.9686641 0.0602673 -0.1224032 0.0793465 0.1086384 -0.6532509 -0.3131334 0.0092534 -0.1104253 -0.1141359 -0.0043524 0.0477686 -0.00948 -0.027284 0.0034507 -0.0687233 -0.0320847 -0.0185788 -0.0083744 0.0068561 -0.0254706 0.0295021 0.0794418 -0.1669183 0.1684939 0.0037384 0.0438821 0.1404761 0.0154127 0.0107805 0.0089433 -0.1562948 -0.1668882 0.2616983 0.0040468 -0.1494038 -0.054056 0.0085377 -0.0081417 -0.0056448 -0.1028002 -0.0481493 -0.0185604 -0.0124143 0.1867219 -0.0316332 -0.0041807 0.0073448 -0.0044058 -0.1306308 0.9976351 -0.5582802 -0.0367852 -0.6295449 0.385629 0.0188051 -0.0385627 0.0232792 0.0754015 0.0371371 0.0017739 -0.0310054 0.0193279 0.0446349 -0.0445825 -0.0398509 -0.010641 -0.1280685 -0.1417732 0.1326964 0.0027388 0.1325856 -0.017353 -0.0006223 0.0312154 -0.0163483 0.0780312 0.0821802 -0.0197444 0.0304227 -0.0388402 0.0445223 -0.0575331 -0.010816 -0.0012299 -0.1491077 -0.0134615 0.0714044 0.0396625 0.0340287 0.0595895 -0.0292983 0.0299725 -0.073435 -0.1155127 0.0051991 -0.0671095 0.0250457 -0.0269687 -0.1120423 0.0731657 -0.0100783 0.1125925 0.0493915 -0.1224668 0.0712305 0.0297782 0.1494377 0.0164835 -0.0455734 0.04101 -0.0440606 0.0740449 0.0634381 -0.0032005 0.0405386 -0.0206694 0.0884467 -0.0062011 -0.0359477 -0.031351 -0.148961 0.1190873 -0.0044889 -0.0032525 -0.0860015 -0.0684625 0.0750837 0.0099951 0.074397 0.0580864 0.0831616 0.0119667 0.0004798 -0.0294329 -0.1022034 -0.0036431 -0.0031862 0.0032525 0.1455647 0.1476222 -0.0235957 0.0007011 0.0419002 0.0471049 -0.0026386 0.0044966 -0.0019611 0.1736052 -0.0315298 -0.0456821 0.0046303 -0.0508437 0.0890621 0.0012763 0.0060015 0.001147 0.1750586 unknown
polarizability: 157.1961939|5.1494804|128.2869454|-0.8980026|1.6622461|65.2905461 unknown
InChI: InChI=1S/C11H11FO/c1-7-2-3-8-4-5-9(12)6-10(8)11(7)13/h4-7H,2-3H2,1H3
charge 0 multiplicity 1
24 atoms
F  3.690358 -1.284091 -0.07785
O  -1.310398 -2.214712 0.009802
C  -2.460632 -0.063548 0.259409
C  -2.244407 1.309872 -0.424499
C  -1.001321 2.025237 0.145057
C  0.239378 1.146587 0.079324
C  -1.219615 -0.954684 0.089865
C  0.120702 -0.275385 0.052615
C  -3.746439 -0.773316 -0.206449
C  1.534547 1.720641 0.048768
C  1.279784 -1.094959 -0.003485
C  2.6933 0.918692 -0.000981
C  2.533398 -0.480713 -0.026659
H  -2.537163 0.124207 1.356479
H  -3.144015 1.93574 -0.274908
H  -2.128647 1.161025 -1.51666
H  -1.199044 2.29731 1.204073
H  -0.817136 2.975581 -0.389657
H  -4.636073 -0.175428 0.061291
H  -3.739974 -0.912666 -1.303019
H  -3.832439 -1.771028 0.253657
H  1.639735 2.811502 0.060225
H  1.167821 -2.183146 -0.025443
H  3.696077 1.355184 -0.026355
