program: Gaussian 09
title: 000242834
version: EM64L-G09RevD.01
frameworkgroup: C1[X(C11H10O)]
method: RPBEPBE
basis: SDD
operation: Freq
keyword: #pfreq=noraman
keyword: PBEPBE/SDD
title: #p freq=noraman PBEPBE/SDD
converged: YES YES NO YES
title: Mulliken charges:
elementType: O C C C C C C C C C C C H H H H H H H H H H
charge: -0.436294 0.384872 0.411691 0.456427 -0.618058 -0.417239 -0.400496 -0.549853 -0.368296 0.299829 -0.406210 -0.811322 0.240326 0.236042 0.236655 0.259919 0.228861 0.218011 0.223840 0.229019 0.229023 0.353251
chargesum: 0.00000
title: Mulliken charges with hydrogens summed into heavy atoms:
elementType: O C C C C C C C C C C C
charge: -0.083043 0.384872 0.411691 0.456427 -0.377731 -0.181196 -0.163841 -0.289933 -0.139434 0.299829 -0.188199 -0.129440
polarizability: 2.02439222e+02 -9.06749226e+00 1.24247893e+02 -5.49035153e-03 -2.66989314e-03 5.28219350e+01
1716.lowfreq: -0.0009 -0.0009 -0.0007 8.3603 15.6129 19.6490 81.2949 96.6559 181.5909
frequency: 81.2888 96.6551 181.5908 209.2919 225.7379 321.6580 330.8510 356.9299 403.2976 405.1740 445.0572 478.4806 523.5979 547.2051 577.4064 652.5160 673.0696 745.6603 773.1099 801.7324 815.9984 827.4686 886.1557 899.8186 919.7494 945.4473 958.5063 973.5683 1005.9868 1049.3062 1127.2753 1146.3447 1158.8599 1187.0157 1188.4356 1260.0038 1264.2000 1273.4663 1350.0290 1398.4247 1408.6628 1426.7698 1432.8336 1468.4693 1472.5934 1489.3614 1516.5078 1583.9745 1625.7036 1651.7812 2971.9072 3048.3057 3082.3542 3107.7617 3112.7305 3114.5034 3139.7915 3140.6924 3154.5362 3584.8725
redmass: 1.8147 1.5877 3.6238 4.0438 3.7092 1.1559 4.0690 3.7088 3.1944 4.9456 3.5643 2.5416 6.4859 2.8573 5.8472 3.1108 6.1754 6.2247 2.1303 1.6725 1.3207 3.9814 1.4542 1.5989 3.9306 1.4110 3.2516 1.3603 1.5369 1.5548 1.6255 1.4242 1.2878 1.4055 1.3846 4.6455 1.7443 1.8052 1.7641 1.2461 2.9333 3.6242 8.6049 1.0456 1.2236 2.6442 3.4727 6.9640 5.8499 6.7523 1.0373 1.0975 1.0986 1.0877 1.0910 1.0871 1.0964 1.0972 1.0923 1.0661
irintensity: 1.4396 0.0133 4.4434 0.6587 2.6690 136.4262 8.2963 11.9760 0.0064 0.0773 2.7909 18.3872 0.3637 0.0756 7.5021 12.2916 0.1231 2.7756 4.2543 19.4471 31.5457 15.8706 60.6315 0.8779 35.9437 3.2888 8.8749 4.6977 11.6035 12.9549 110.6748 68.1460 51.9891 8.7678 12.3720 42.1741 54.7855 9.2682 2.0283 11.4236 14.3415 0.7497 0.0820 13.0494 24.2499 9.1790 54.4858 16.0225 57.4537 33.2294 47.4723 22.9851 18.1071 13.6607 16.5143 12.6213 35.6273 12.9520 5.5666 49.9695
temp: 298.150 k
press: 1.00000 atm
elementType: 8 6 6 6 6 6 6 6 6 6 6 6 1 1 1 1 1 1 1 1 1 1
symmnumber: 1
zpe: 460565.2 jmol-1
zpe.correction: 0.175420 hartree
zpe.thermalcorrener: 0.185466 hartree
zpe.thermalcorrenthalpy: 0.186410 hartree
zpe.thermalcorrgfe: 0.140222 hartree
zpe.sumelectzpe: -499.565286 hartree
zpe.sumelectthermal: -499.555240 hartree
zpe.sumelectthermalent: -499.554296 hartree
zpe.sumelectthermalfe: -499.600485 hartree
dipole: 0.2428 1.7156 0.0005
dipole: 1.7327
quadrupole: -57.5501 -62.8172 -75.8589
quadrupole: -7.9783 0.0028 0.0030
quadrupole: 7.8586 2.5915 -10.4502 -7.9783 0.0028 0.0030
hfenergy: -499.7407064 hartree
pointgroup: C01 [X(C11H10O1)]
dipole: 0.0858822 0.6758102 0.0248573 debye
dipolederiv: -1.6484517 -0.1884053 -0.0034517 -0.4320949 -0.1143318 0.0127318 -0.0124422 0.0120547 -0.4278645 -0.0269811 0.0550508 0.0022156 -0.0236771 -0.190581 -0.0081269 -0.0005867 -0.0084189 0.0323687 0.3256683 0.0688756 0.0016337 -0.0361614 -0.0840114 -0.0042664 -0.0022701 -0.0046096 0.0338257 0.3487204 0.126647 0.0038897 0.1374173 -0.0934852 -0.0023296 0.0046409 -0.0023956 -0.0393848 -0.0800889 -0.0794115 -0.0032587 0.1134433 0.0982343 0.0104166 0.003701 0.0110558 -0.1903995 -0.0986985 -0.0559002 -0.0022432 0.0080615 0.1361039 0.0113669 0.0001759 0.0116439 -0.1717559 0.1599992 -0.121896 -0.0053522 -0.016198 0.1481156 0.0109628 -0.0014152 0.011423 -0.1486756 -0.4478979 -0.0853835 -0.0024288 0.253102 0.0596056 0.0089494 0.0099567 0.0099974 -0.2016464 -0.115036 -0.0462261 -0.0019826 -0.1530013 0.1366908 0.0119914 -0.006092 0.0117597 -0.1774064 1.5620626 0.2085037 0.0034205 0.3490345 0.0709883 -0.0010085 0.0086774 -0.0006838 0.0714528 -0.3089232 -0.0038134 0.0001061 -0.3273334 0.0238552 0.0092907 -0.0117615 0.0083669 -0.2042227 -0.1457663 -0.0325064 -0.0007462 0.0340993 0.0736048 -0.0002228 0.0015909 -0.00002 0.0768687 0.0529876 -0.0278758 -0.0007904 -0.0819163 -0.1036755 -0.0092048 -0.0028643 -0.0094511 0.1505191 0.0553697 -0.0788649 -0.0026415 -0.0167157 -0.102817 -0.0094569 -0.0002887 -0.0093318 0.1534707 0.0652018 -0.0741982 -0.0024795 -0.0133229 -0.0950689 -0.0090839 -0.0002445 -0.0089962 0.1528932 0.0752103 -0.0071249 0.000016 -0.0644497 -0.050433 -0.0080855 -0.0020982 -0.008287 0.1732703 -0.0514943 0.1224372 0.0050855 0.1110643 -0.0043528 -0.0060264 0.0046454 -0.0060482 0.1499777 -0.0958955 0.1131985 0.0049192 0.0924536 0.0123365 -0.0060952 0.004184 -0.0061518 0.1711845 0.0637298 0.03013 0.0012179 -0.1042903 -0.1449735 -0.0091039 -0.0037707 -0.0094382 0.1065435 -0.0516198 0.0121085 -0.0730374 0.030571 0.0629352 0.0941943 -0.1417775 0.0625676 -0.0413652 -0.0507325 0.0064171 0.073853 0.019642 0.0739761 -0.0856742 0.1437281 -0.0539927 -0.0532797 0.4126359 0.0582379 0.0020552 0.1202722 0.0872838 -0.011219 0.0043116 -0.0110441 0.3836257 unknown
polarizability: 202.6811312|-7.9267662|123.9071373|-0.7007469|2.6358206|52.9207811 unknown
InChI: InChI=1S/C11H10O/c1-8-2-3-10-7-11(12)5-4-9(10)6-8/h2-7,12H,1H3
charge 0 multiplicity 1
22 atoms
O  -3.91074 -0.574454 -0.01301
C  0.148126 0.706987 0.022334
C  -0.19448 -0.700609 -0.028286
C  2.559807 0.149523 -0.004398
C  1.529188 1.094787 0.032998
C  0.874846 -1.65847 -0.0666
C  -0.913762 1.668146 0.06055
C  -1.568411 -1.09505 -0.038807
C  2.205822 -1.244803 -0.055053
C  -2.575162 -0.127798 -0.000388
C  -2.250478 1.266938 0.049756
C  4.022201 0.556588 0.007595
H  1.772646 2.164549 0.072076
H  0.628276 -2.726201 -0.105462
H  -0.665508 2.735223 0.09911
H  -1.843693 -2.153959 -0.077135
H  3.00922 -1.99166 -0.084919
H  -3.054884 2.014275 0.079499
H  4.137064 1.653447 0.04817
H  4.550687 0.128484 0.880785
H  4.547101 0.194464 -0.89701
H  -4.537165 0.190393 0.016791
