program: Gaussian 09
title: 000242833
version: EM64L-G09RevD.01
frameworkgroup: C1[X(C8H9FN2O)]
method: RPBEPBE
basis: SDD
operation: Freq
keyword: #p
keyword: freq=noraman
keyword: PBEPBE/SDD
title: #p freq=noraman PBEPBE/SDD
converged: YES YES NO NO
title: Mulliken charges:
elementType: F O N N C C C C C C C C H H H H H H H H H
charge: -0.231547 -0.305868 -0.433697 -0.690938 0.181338 0.377613 0.184335 -0.402591 -0.397217 -0.183953 0.232233 -0.790455 0.339398 0.217068 0.255699 0.229162 0.295098 0.372531 0.240309 0.268585 0.242896
chargesum: 0.00000
title: Mulliken charges with hydrogens summed into heavy atoms:
elementType: F O N N C C C C C C C C
charge: -0.231547 -0.305868 -0.094299 -0.023308 0.181338 0.377613 0.184335 -0.185523 -0.141518 0.045209 0.232233 -0.038665
polarizability: 1.54950045e+02 -3.03659932e+00 1.18871090e+02 -1.36545434e+00 3.96498838e-02 5.04850465e+01
1716.lowfreq: -91.0029 -14.3240 -7.2251 -0.0010 -0.0009 -0.0005 4.0060 39.1558 82.5349
frequency: -90.9976 39.0605 82.5323 145.7486 200.2710 227.0083 270.2999 301.7264 318.4297 365.1369 465.6264 487.8573 499.1873 515.6030 531.1298 564.7232 571.9947 612.0608 688.5323 710.3466 718.7076 759.4024 798.3202 817.4931 836.1957 923.3245 941.0321 986.0256 997.9709 1033.0731 1046.3364 1117.4412 1173.4096 1216.5492 1229.1446 1301.0617 1340.9901 1379.0021 1406.6341 1438.9817 1452.0106 1467.8654 1495.8902 1532.8848 1574.1177 1595.8837 1647.5624 1669.4731 2992.2544 3077.1595 3130.2698 3140.6024 3158.4460 3192.9016 3238.3357 3492.6555 3619.5111
redmass: 1.0494 6.2599 4.1059 5.0546 4.7619 4.4799 8.5885 4.3473 4.8941 4.3045 1.1454 4.2198 6.4718 4.5790 4.3889 4.3535 3.3079 4.8953 1.7241 1.9259 2.8033 1.9718 2.9996 1.3476 1.4047 5.1635 1.2962 3.6347 1.9041 1.6309 1.9650 1.4798 1.1029 3.1372 2.3741 2.6264 2.1227 1.2360 7.8601 1.8669 1.4098 1.0477 3.1560 2.2272 3.5322 4.3443 4.5989 1.4643 1.0384 1.0984 1.0879 1.0982 1.0937 1.0967 1.0676 1.0756 1.0860
irintensity: 0.0731 5.8786 3.9342 1.0085 11.0094 0.9433 0.6609 13.7772 4.5321 0.7258 83.9351 2.8657 29.4169 4.7011 7.7511 0.3436 2.1968 6.5725 4.7776 122.5087 17.9018 90.0424 29.1294 141.5879 3.0583 15.7338 1.2073 31.3838 21.1633 11.7956 8.6370 31.9145 7.4006 4.1878 11.3013 61.5396 3.7706 39.0116 152.2927 154.4671 9.0703 20.7218 3.7901 321.8668 28.3889 127.3510 244.6235 28.0313 7.9115 13.1252 10.2788 5.7274 19.7210 1.1356 300.0760 39.3705 40.9998
temp: 298.150 k
press: 1.00000 atm
elementType: 9 8 7 7 6 6 6 6 6 6 6 6 1 1 1 1 1 1 1 1 1
symmnumber: 1
zpe: 421900.1 jmol-1
zpe.correction: 0.160693 hartree
zpe.thermalcorrener: 0.171161 hartree
zpe.thermalcorrenthalpy: 0.172106 hartree
zpe.thermalcorrgfe: 0.124204 hartree
zpe.sumelectzpe: -593.966736 hartree
zpe.sumelectthermal: -593.956267 hartree
zpe.sumelectthermalent: -593.955323 hartree
zpe.sumelectthermalfe: -594.003225 hartree
dipole: 0.0986 -0.3640 0.9236
dipole: 0.9976
quadrupole: -61.4939 -65.0771 -74.0657
quadrupole: 10.0288 -3.0544 0.2962
quadrupole: 5.3850 1.8018 -7.1868 10.0288 -3.0544 0.2962
hfenergy: -594.1274289 hartree
pointgroup: C01 [X(C8H9F1N2O1)]
dipole: -0.0089176 0.0519605 -0.388928 debye
dipolederiv: -0.6070047 0.3381674 0.2383701 0.2375509 -0.504318 -0.2233598 0.1981228 -0.2371609 -0.2975041 -0.6707235 0.0810391 0.1714325 -0.239705 -0.6947824 -0.3257756 -0.3570148 -0.4269277 -0.7593092 -1.1038503 -0.4009288 -0.211243 -0.4951692 -0.5444575 -0.1323438 -0.340083 -0.2128264 -0.4353455 -0.3364861 -0.2287131 -0.0694571 -0.1004316 -1.2973761 -0.1996092 -0.0966035 -0.0477761 -0.6133952 0.548797 0.3536779 0.0665902 -0.0466507 -0.329068 -0.1936253 -0.1427153 -0.2081888 -0.117315 -0.0473561 0.2089949 0.0744507 0.0733633 1.1498924 0.3614437 0.0638319 0.4196725 0.2683949 0.7743364 -0.198172 -0.2014378 0.0069591 0.6818318 0.3280956 -0.1004286 0.3705403 0.277408 0.0497317 -0.3567819 -0.1828643 0.0658899 -0.259996 0.0034859 0.0082728 0.0151133 -0.2215736 -0.5402839 -0.0078663 0.0302967 -0.0016798 -0.2397827 0.0074259 0.0397289 -0.0271069 -0.2418533 0.1300635 -0.0064812 -0.0420025 -0.2439908 0.1756751 0.1580485 -0.1626726 0.1437293 -0.0454344 1.2919743 0.2794362 0.0008149 0.7308238 0.8694941 0.6207418 0.4410313 0.6948166 0.8637953 -0.3957294 -0.0278141 0.0947945 0.0098394 0.0160593 -0.0473323 0.2305535 -0.010984 -0.0237346 0.1744736 -0.011899 0.0095098 0.0306706 0.2446844 -0.0667706 0.065751 -0.0360076 0.2555552 -0.0128969 0.0509356 0.0517117 0.0997175 0.0042649 -0.0931577 0.071509 -0.0900639 0.1138656 0.0905158 -0.0250108 0.0020464 -0.0270223 0.003146 -0.0936424 -0.0012105 -0.0918665 0.1557322 -0.0977022 -0.0652851 0.0037204 -0.0623881 0.0859242 -0.027126 0.004234 -0.0234815 0.1465698 0.0702497 0.0153481 0.0299349 -0.0056902 0.2822894 -0.0453561 0.0364171 -0.0900808 0.3001683 0.562791 0.0296708 -0.0278588 -0.023866 0.2870626 -0.0280019 0.0796429 -0.1366617 0.281496 0.0452302 0.0156245 0.0081574 0.0870264 -0.0867264 0.0177435 0.0010863 0.0119457 0.1192417 0.0411438 -0.0420097 -0.0251777 -0.0811044 0.0540075 -0.0692134 -0.0779946 -0.0782852 0.0594679 0.0327262 -0.0019326 -0.0217892 -0.0141426 0.1021754 0.0483294 0.0385415 0.0616003 -0.08623 unknown
polarizability: 144.8076662|18.853627|111.2940776|-1.3084738|31.5352691|68.2044376 unknown
InChI: InChI=1S/C8H9FN2O/c1-5(12)11-8-6(9)3-2-4-7(8)10/h2-4,11H,10H2,1H3
charge 0 multiplicity 1
21 atoms
F  0.475493 -1.925743 -1.284478
O  1.726631 2.040265 1.329151
N  1.231111 0.410879 -0.303655
N  -0.931436 2.212554 0.88749
C  -0.16432 0.10759 -0.164506
C  -1.195801 0.952169 0.378623
C  -0.567156 -1.133467 -0.716174
C  -2.542056 0.462655 0.341111
C  -1.875847 -1.61528 -0.773144
C  -2.877576 -0.779134 -0.222453
C  2.083583 1.257668 0.388873
C  3.536767 1.18375 -0.077067
H  1.694837 -0.212436 -0.973067
H  -3.329732 1.098368 0.76216
H  -2.091582 -2.58869 -1.218159
H  -3.922372 -1.105403 -0.234483
H  -1.709219 2.75398 1.2590
H  0.036164 2.433281 1.185998
H  3.937731 0.157466 0.013443
H  4.137855 1.856165 0.550634
H  3.635726 1.498662 -1.131998
