program: Gaussian 09
title: 000242832
version: EM64L-G09RevD.01
frameworkgroup: C1[X(C8H8FNO2)]
method: RPBEPBE
basis: SDD
operation: Freq
keyword: #p
keyword: freq=noraman
keyword: PBEPBE/SDD
title: #p freq=noraman PBEPBE/SDD
converged: NO YES NO NO
title: Mulliken charges:
elementType: F O O N C C C C C C C C H H H H H H H H
charge: -0.179038 -0.279822 -0.242270 0.019087 0.263649 -0.223124 0.217761 -0.405557 -0.272795 -0.670478 0.108232 -0.309571 0.234951 0.234995 0.292627 0.273912 0.217478 0.232694 0.232687 0.254580
chargesum: 0.00000
title: Mulliken charges with hydrogens summed into heavy atoms:
elementType: F O O N C C C C C C C C
charge: -0.179038 -0.279822 -0.242270 0.019087 0.263649 0.246823 0.217761 -0.112930 0.001117 0.012382 0.108232 -0.054991
polarizability: 1.34405807e+02 -3.25137215e+00 1.09431028e+02 3.09053169e-02 -2.32759281e-02 4.99677419e+01
1716.lowfreq: -6.0496 -5.8836 0.0006 0.0009 0.0012 9.0741 36.9126 68.2015 89.9594
frequency: 36.8610 68.1878 89.9591 95.7348 181.9561 215.5390 224.8676 249.7463 311.8523 350.7559 387.6326 438.1812 495.4848 532.2398 537.8609 662.0688 715.6696 740.5834 778.0378 798.8517 823.9781 874.9398 904.3794 906.8829 957.7637 981.0747 1019.9186 1068.0923 1094.8784 1114.0429 1135.8861 1172.1397 1250.4324 1263.1459 1287.0926 1328.0208 1359.4927 1382.5510 1403.0875 1447.0331 1463.2905 1473.0876 1485.6469 1555.6915 1585.6351 1622.3867 2998.9991 3014.2670 3073.9493 3095.6104 3111.2097 3157.9026 3185.7311 3204.4793
redmass: 3.1953 4.4122 4.5738 2.8614 2.9861 4.5904 5.4822 1.4733 4.8915 8.3329 5.1237 3.3417 5.6087 10.6842 6.1126 7.9928 7.8448 3.2101 7.9232 1.1030 3.8741 1.4103 5.7336 1.4286 7.2676 1.3927 2.2443 2.9422 1.5704 2.2325 1.4702 2.2710 1.1304 3.8456 1.6088 9.3661 1.4619 3.3925 1.2712 2.1778 1.0401 1.0658 1.0668 9.0677 6.5766 11.3262 1.0360 1.0582 1.1068 1.0985 1.1029 1.0900 1.0971 1.0941
irintensity: 0.4396 1.9667 0.5450 0.0474 7.7158 0.4404 8.5373 3.4722 3.6627 7.5690 2.6842 4.5371 1.8727 5.4623 0.7628 8.9543 8.5519 25.3510 23.1731 2.5554 4.0209 34.8368 49.6748 12.4629 3.6858 0.8160 45.1522 142.9576 26.1795 3.2903 6.1968 204.5046 0.0616 192.1437 83.2948 12.6357 2.6027 82.9603 30.0074 35.5465 13.1464 4.1693 14.9886 121.7797 37.4153 115.8481 17.3808 15.3551 6.3170 26.1558 41.0463 10.4768 4.6260 2.6068
temp: 298.150 k
press: 1.00000 atm
elementType: 9 8 8 7 6 6 6 6 6 6 6 6 1 1 1 1 1 1 1 1
symmnumber: 1
zpe: 387080.4 jmol-1
zpe.correction: 0.147431 hartree
zpe.thermalcorrener: 0.158618 hartree
zpe.thermalcorrenthalpy: 0.159562 hartree
zpe.thermalcorrgfe: 0.109066 hartree
zpe.sumelectzpe: -613.812091 hartree
zpe.sumelectthermal: -613.800904 hartree
zpe.sumelectthermalent: -613.799960 hartree
zpe.sumelectthermalfe: -613.850457 hartree
dipole: -3.8136 -0.3950 -0.0013
dipole: 3.8340
quadrupole: -69.3255 -72.4737 -68.6831
quadrupole: -13.6414 -0.0042 -0.0033
quadrupole: 0.8352 -2.3129 1.4777 -13.6414 -0.0042 -0.0033
hfenergy: -613.9595225 hartree
pointgroup: C01 [X(C8H8F1N1O2)]
dipole: 1.5022173 -0.1363778 0.0005012 debye
dipolederiv: -0.3790598 0.3356563 0.0000516 0.3828455 -0.9908765 -0.0001726 0.000036 -0.0000535 -0.1811915 -1.44965 -0.4735986 0.0003949 -0.6634272 -0.8327083 -0.0000749 0.0013914 0.0008201 -0.2718805 -0.7338961 0.2217794 -0.0003754 -0.0801376 -0.8732391 0.0007419 -0.0001904 -0.0009886 -0.3145833 -0.401583 -0.1541493 -0.0002122 0.155152 -0.5100254 -0.0000331 -0.0002433 -0.00029 -0.1995148 -0.266786 0.0431026 0.0001233 0.0836224 0.1756369 0.0001675 -0.0004638 0.0001192 0.0083387 0.9712904 0.2539986 -0.0003859 0.1507411 0.2953972 -0.0000822 -0.0005936 -0.0003181 0.3524473 1.714296 0.052733 0.0003109 0.5709987 1.3596026 -0.000584 0.0006353 0.000327 0.2285888 -0.2081314 0.3645197 0.0001606 -0.0567957 -0.2476545 -0.0001343 -0.000464 0.0003368 -0.0740946 -0.3130424 -0.2404858 -0.0002548 0.0589809 -0.0838318 -0.0000377 -0.0005152 -0.0002024 -0.0782613 -0.0628032 -0.0945164 0.0000548 -0.0777179 -0.0646528 0.0001477 0.0001222 0.0001581 0.0587909 0.5607595 -0.5171827 0.0000191 -0.4728349 1.3053953 0.0002733 0.0002299 -0.0000259 0.1780245 0.3670082 0.2807382 0.0005795 -0.0166359 0.2741177 0.0001829 0.0005573 0.0005148 -0.0799523 -0.0607252 -0.0473045 -0.0042261 0.0296893 0.0046926 0.0916411 -0.0428213 0.0874758 -0.0520361 -0.0605768 -0.0475323 0.0041293 0.0294741 0.0045854 -0.09168 0.0427362 -0.0873712 -0.0519573 0.1152175 -0.0543684 -0.0001283 -0.0546337 0.0708094 -0.0000813 -0.0001542 -0.0000797 0.1709859 0.1313114 0.0635195 -0.0000273 0.0222975 0.0224412 -0.0000459 -0.0000659 -0.000034 0.1672955 -0.1674952 -0.0062042 0.0002621 0.0122145 0.0751231 -0.0000222 0.000311 0.0000187 0.1195929 0.1123938 0.055942 -0.0693859 -0.0020786 0.0174338 0.0813291 -0.0480538 0.0987077 -0.05883 0.1126362 0.0557755 0.0690516 -0.002238 0.0172992 -0.0813848 0.0476686 -0.0988945 -0.0589562 0.018836 -0.0924227 -0.000142 -0.0695165 -0.0195461 -0.0001503 -0.0001227 -0.00022 0.1371933 unknown
polarizability: 134.3194203|3.5667125|109.5174146|0.030608|0.0236656|49.9677419 unknown
InChI: InChI=1S/C8H8FNO2/c1-2-12-8(11)6-3-4-10-7(9)5-6/h3-5H,2H2,1H3
charge 0 multiplicity 1
20 atoms
F  -2.688729 2.280129 0.000155
O  1.965194 0.366485 0.001317
O  1.68554 -1.949105 0.000251
N  -3.061562 -0.013457 -0.001447
C  -0.269101 -0.490591 0.001118
C  3.451197 0.172296 -0.00023
C  1.198429 -0.792411 0.002547
C  -0.763919 0.834465 0.001296
C  -1.186562 -1.574058 -0.000411
C  4.076651 1.561714 -0.001375
C  -2.165211 0.977432 -0.000013
C  -2.566943 -1.290442 -0.001637
H  3.718822 -0.417358 0.894955
H  3.716913 -0.417967 -0.895581
H  -0.096117 1.697125 0.002442
H  -0.813442 -2.601413 -0.000563
H  5.178004 1.471343 -0.002518
H  3.775652 2.131607 -0.8967
H  3.777561 2.132218 0.894199
H  -3.312577 -2.091113 -0.002806
