program: Gaussian 09
title: 000242829
version: EM64L-G09RevD.01
frameworkgroup: C1[X(C8H7FO2)]
method: RPBEPBE
basis: SDD
operation: Freq
keyword: #pfreq=noraman
keyword: PBEPBE/SDD
title: #p freq=noraman PBEPBE/SDD
converged: NO YES NO NO
title: Mulliken charges:
elementType: F O O C C C C C C C C H H H H H H H
charge: -0.167181 -0.450078 -0.218446 0.471883 0.116685 -0.442740 -0.357201 0.202611 -0.346062 -0.803193 0.115988 0.287720 0.242448 0.260556 0.233175 0.225928 0.241049 0.386858
chargesum: 0.00000
title: Mulliken charges with hydrogens summed into heavy atoms:
elementType: F O O C C C C C C C C
charge: -0.167181 -0.063220 -0.218446 0.471883 0.116685 -0.155020 -0.114753 0.202611 -0.085506 -0.103040 0.115988
polarizability: 1.28800066e+02 1.41209008e+00 1.04771581e+02 2.63994589e-01 -2.42058593e-01 4.23256114e+01
1716.lowfreq: -36.1212 -10.8171 -1.9066 -0.0005 0.0005 0.0006 6.9048 34.5126 119.9358
frequency: -35.8219 34.4816 119.9302 156.0255 177.3228 281.1013 333.2859 354.8000 382.1809 423.1103 453.7452 511.6818 523.1032 593.1332 613.5917 686.3330 697.8202 745.8287 764.4950 826.3546 896.2608 922.2339 965.2956 993.3059 1005.4159 1051.8948 1113.8191 1143.2973 1202.5227 1230.7719 1265.2627 1314.1264 1383.6839 1393.0403 1402.0595 1473.0278 1475.5448 1489.9599 1593.6464 1615.8376 1654.4925 2981.9265 3064.2139 3092.2931 3138.6003 3170.2217 3177.9442 3530.7381
redmass: 1.0188 11.5783 4.9648 4.1933 5.9989 5.3415 4.6288 4.6545 10.5391 3.1335 6.5679 4.6609 2.8551 1.2615 5.2006 4.0418 5.7726 5.8251 4.8718 1.3900 4.7305 1.3910 1.3589 3.5867 1.5196 1.5566 2.0796 1.3253 2.5787 2.5245 1.4852 2.6264 6.8562 3.5716 1.2494 1.1133 1.0753 2.8569 7.0251 7.0006 8.8139 1.0388 1.0953 1.0999 1.0902 1.0921 1.0956 1.0642
irintensity: 0.7018 0.4978 0.5624 1.4095 0.5700 0.1258 0.7416 1.4622 3.3754 10.2922 6.1458 26.4221 1.8104 149.8996 27.5757 19.8607 2.1251 21.0637 9.8972 49.4039 16.6072 1.8981 3.2501 229.9622 4.3774 17.5045 67.7018 66.6890 30.9074 3.0345 3.8473 71.6330 4.4007 1.2527 14.3878 19.1604 14.5048 80.5720 38.0336 19.4868 314.9674 27.0913 19.3554 15.2137 11.1440 1.1551 3.3153 44.9143
temp: 298.150 k
press: 1.00000 atm
elementType: 9 8 8 6 6 6 6 6 6 6 6 1 1 1 1 1 1 1
symmnumber: 1
zpe: 343446.4 jmol-1
zpe.correction: 0.130812 hartree
zpe.thermalcorrener: 0.140121 hartree
zpe.thermalcorrenthalpy: 0.141065 hartree
zpe.thermalcorrgfe: 0.095463 hartree
zpe.sumelectzpe: -558.556967 hartree
zpe.sumelectthermal: -558.547659 hartree
zpe.sumelectthermalent: -558.546715 hartree
zpe.sumelectthermalfe: -558.592316 hartree
dipole: 3.9993 -1.9006 0.0416
dipole: 4.4281
quadrupole: -60.8872 -57.2327 -64.5220
quadrupole: 8.9019 0.2100 -0.0969
quadrupole: -0.0066 3.6479 -3.6413 8.9019 0.2100 -0.0969
hfenergy: -558.6877793 hartree
pointgroup: C01 [X(C8H7F1O2)]
dipole: -1.5501517 0.7924877 0.0642691 debye
dipolederiv: -0.574369 0.4288366 0.0154723 0.3720836 -0.6137964 -0.013989 0.0132524 -0.0141078 -0.1229795 -0.3597102 -0.1557237 -0.0019693 -0.2779938 -1.2800927 0.0036844 -0.0026952 -0.0004572 -0.4313446 -1.097477 0.1678824 0.0189927 0.0357886 -0.5755004 -0.0016462 0.0169672 -0.0044801 -0.3186317 0.1363649 -0.3680645 -0.0220209 -0.3680131 -0.0462794 0.0189791 -0.0735829 0.0492228 -0.039131 -0.6758463 -0.2919479 0.0121884 -0.1243438 -0.2336825 -0.0016299 0.0189795 0.0018363 -0.0011422 0.1021797 0.2799875 -0.0008757 -0.0813896 -0.0113302 0.0102728 0.0053305 -0.0012112 -0.1195526 0.0805234 -0.0030223 -0.009449 0.1542384 0.1209884 -0.0059003 -0.0016453 -0.0078805 -0.1384601 0.7451609 -0.5086848 -0.0171425 -0.1715896 0.6784251 0.0071727 -0.0157514 0.0165305 0.1013851 -0.3129579 0.2053523 0.0075189 -0.0065617 0.0102961 0.0065304 0.0091769 -0.0040538 -0.1551902 -0.0410005 0.0927776 0.0134105 0.1116708 -0.0216469 -0.0076727 0.0872575 -0.0571264 0.0600836 1.7337976 0.2328492 -0.033588 0.3523806 1.5465806 -0.0035286 -0.0324491 0.001487 0.2468182 0.1377383 0.0089826 -0.0025736 0.0035407 -0.0019766 -0.0012849 -0.0024729 0.0030913 0.1507957 -0.0815503 -0.06569 0.0034636 -0.0512163 0.0771163 0.0034554 -0.0010589 0.001033 0.1486258 0.0908067 -0.0061164 0.001135 -0.0113798 -0.0419185 -0.002239 -0.0009076 -0.0020689 0.1808696 0.0555141 -0.052761 0.047058 0.021637 -0.0647398 0.0945337 -0.0104876 0.1080253 0.0539238 -0.0825128 -0.0234646 -0.0650252 -0.1101697 0.0289433 -0.0567781 -0.088937 -0.0164535 0.0799262 0.0345048 0.0601286 0.0268633 0.0699834 0.0667688 -0.0478573 0.0722785 -0.0731639 -0.0949785 0.1088335 -0.0013216 0.0065416 0.0813343 0.3618449 -0.0021025 0.0067452 -0.0002229 0.3989822 unknown
polarizability: 128.7898442|0.7434088|104.6998139|-2.4991594|0.8266318|42.4076002 unknown
InChI: InChI=1S/C8H7FO2/c1-5-2-3-7(9)6(4-5)8(10)11/h2-4,10H,1H3
charge 0 multiplicity 1
18 atoms
F  1.337964 -2.172764 -0.077177
O  1.889201 2.107708 -0.064238
O  2.983428 0.063861 -0.096241
C  -1.931098 0.505784 0.018783
C  0.524343 0.13911 -0.040554
C  -0.608051 1.000231 -0.009828
C  -2.120775 -0.901751 0.008475
C  0.278665 -1.257811 -0.045038
C  -1.022453 -1.785611 -0.021786
C  -3.116263 1.453364 0.080798
C  1.902951 0.694947 -0.070638
H  -0.423571 2.078155 -0.009022
H  -3.13713 -1.311426 0.023739
H  -1.157335 -2.870856 -0.031709
H  -2.922466 2.381462 -0.484142
H  -4.028544 0.987816 -0.330348
H  -3.336844 1.745281 1.125527
H  2.832278 2.423398 -0.084002
