program: Gaussian 09
title: 000242828
version: EM64L-G09RevD.01
frameworkgroup: C1[X(C8H7FO2)]
method: RPBEPBE
basis: SDD
operation: Freq
keyword: #pfreq=noraman
keyword: PBEPBE/SDD
title: #p freq=noraman PBEPBE/SDD
converged: NO YES NO NO
title: Mulliken charges:
elementType: F O O C C C C C C C C H H H H H H H
charge: -0.192849 -0.442163 -0.251385 0.305721 0.267622 -0.503700 0.207213 -0.304057 -0.344773 -0.777149 0.109826 0.280166 0.280970 0.260217 0.245105 0.245110 0.228322 0.385804
chargesum: 0.00000
title: Mulliken charges with hydrogens summed into heavy atoms:
elementType: F O O C C C C C C C C
charge: -0.192849 -0.056359 -0.251385 0.305721 0.267622 -0.223534 0.207213 -0.023087 -0.084556 -0.058613 0.109826
polarizability: 1.33376040e+02 -4.93346391e-01 1.01656124e+02 -1.91904205e-03 6.99363851e-04 4.21375614e+01
1716.lowfreq: -6.2022 -4.4161 0.0006 0.0010 0.0013 11.0894 66.5703 76.8316 106.2220
frequency: 66.3647 76.6346 106.2173 171.9095 192.5377 261.7114 306.0223 333.3809 382.1021 441.9068 518.4525 521.3017 536.0238 574.0499 604.6476 683.6911 696.7333 738.6618 752.6263 838.0423 894.2395 935.3401 971.7178 989.0793 1043.7493 1051.2869 1107.8824 1138.0750 1176.6342 1232.5513 1262.7041 1326.1115 1391.4596 1404.8561 1412.3215 1462.1751 1467.9948 1490.8289 1592.2008 1618.2594 1643.2899 2990.4645 3069.9574 3102.8452 3153.7367 3168.0090 3189.2027 3532.7000
redmass: 3.8974 1.1876 8.5675 5.8572 3.1701 3.9558 5.7330 10.0711 6.2229 2.9676 5.8263 2.6641 4.9574 5.4214 1.3547 5.3389 3.9727 5.4901 4.1058 1.4423 5.6394 1.3999 1.3547 1.6958 2.4180 1.5243 2.1852 1.5254 1.9416 3.0447 1.3698 2.5580 5.7329 1.3478 3.3426 1.0440 1.6391 1.7728 7.2257 6.9749 8.6522 1.0370 1.0974 1.1000 1.0924 1.0894 1.0973 1.0642
irintensity: 2.2226 0.0292 0.3732 1.7730 4.7499 2.1025 0.2629 3.4094 9.2030 4.7869 3.5445 30.6059 18.9303 41.0310 99.8843 3.0256 37.3506 16.0163 32.0829 34.3765 28.5221 13.7493 0.6560 53.3375 182.6704 9.3359 119.7559 84.5650 4.4768 35.4367 8.1346 105.1215 9.4697 17.0521 29.6941 14.2615 21.7465 64.1941 9.1008 81.7291 245.3025 18.3100 13.5998 12.5294 1.5722 1.2285 1.5155 47.4927
temp: 298.150 k
press: 1.00000 atm
elementType: 9 8 8 6 6 6 6 6 6 6 6 1 1 1 1 1 1 1
symmnumber: 1
zpe: 344660.2 jmol-1
zpe.correction: 0.131274 hartree
zpe.thermalcorrener: 0.141286 hartree
zpe.thermalcorrenthalpy: 0.142231 hartree
zpe.thermalcorrgfe: 0.095323 hartree
zpe.sumelectzpe: -558.566530 hartree
zpe.sumelectthermal: -558.556518 hartree
zpe.sumelectthermalent: -558.555574 hartree
zpe.sumelectthermalfe: -558.602482 hartree
dipole: 0.0025 -0.8271 0.0000
dipole: 0.8271
quadrupole: -61.4939 -60.6817 -64.4475
quadrupole: -9.1358 -0.0010 0.0000
quadrupole: 0.7138 1.5260 -2.2398 -9.1358 -0.0010 0.0000
hfenergy: -558.6978042 hartree
pointgroup: C01 [X(C8H7F1O2)]
dipole: 0.0122345 0.3251279 -0.0045191 debye
dipolederiv: -1.1441219 -0.1665769 0.0115867 -0.1632375 -0.2503643 0.0029459 0.0115971 0.0029904 -0.1461281 -0.8879178 0.4926287 -0.0023701 0.621701 -0.8105403 -0.000582 -0.0038846 0.0003551 -0.4289623 -0.9138126 -0.2836352 0.0091325 -0.2563601 -0.8863458 0.0096513 0.0089801 0.0102891 -0.3330925 -0.0578951 -0.2961143 0.004199 -0.4477361 0.0401686 0.0029918 0.0063677 0.0014846 -0.0427606 -0.737488 -0.0763064 0.0079305 -0.098865 -0.0909611 0.0021925 0.0081044 0.0019611 0.0031828 0.140263 0.173319 -0.0047526 -0.1049603 -0.0086029 -0.000565 -0.0011189 -0.0031262 -0.1218703 1.2208077 0.1819244 -0.0131351 0.2441876 0.316023 -0.0054527 -0.014093 -0.0048824 0.082976 0.1869816 -0.010133 -0.0027074 0.167046 0.0271657 -0.0035072 -0.0052129 -0.0019017 -0.1192648 -0.3369081 0.0443876 0.0011181 0.2129521 -0.0129554 -0.0038949 -0.0011327 -0.0022552 -0.1531309 -0.0858317 0.1440051 -0.0005387 0.0873551 0.014986 -0.0000852 0.0001621 -0.000436 0.0668272 2.0479937 -0.021771 -0.0164748 -0.0896225 1.3466052 -0.0139827 -0.015731 -0.01471 0.2356815 0.1198346 -0.037483 0.000814 -0.0184045 -0.0027532 0.002268 0.0005366 0.0024352 0.1531116 0.0840009 0.0605469 -0.0000868 0.0585491 0.0389193 0.0011499 -0.0000704 0.0011275 0.1636923 0.0637658 -0.0502528 0.0017465 -0.056192 -0.0177866 0.0031711 0.0018521 0.0031039 0.1781336 0.0230263 0.037892 0.0962168 0.0241822 0.0569525 0.0326948 0.114495 -0.0216197 -0.028064 0.0193176 0.0357837 -0.0980003 0.0207146 0.0565722 -0.0351457 -0.1159207 0.0188147 -0.0241205 0.0301846 -0.1342828 0.0024267 -0.0288533 -0.0732982 0.0026102 0.0011096 0.0035402 0.1118764 0.2277995 -0.093932 0.002895 -0.1724565 0.2562153 0.0035399 0.0039593 0.0028294 0.4019125 unknown
polarizability: 133.2760242|-1.7889273|101.7378282|-0.8182665|-0.7921062|42.1558731 unknown
InChI: InChI=1S/C8H7FO2/c1-5-4-6(8(10)11)2-3-7(5)9/h2-4,10H,1H3
charge 0 multiplicity 1
18 atoms
F  3.21428 0.744282 -0.040356
O  -3.156716 0.981646 0.015793
O  -2.90652 -1.328479 0.04461
C  1.373023 -0.822843 -0.001731
C  -0.9209 0.09595 0.00688
C  -0.026483 -1.00731 0.013597
C  1.822721 0.519283 -0.024182
C  -0.418578 1.42236 -0.015669
C  0.973144 1.638231 -0.031465
C  2.355415 -1.975206 0.004736
C  -2.377883 -0.189334 0.023915
H  -0.446324 -2.018718 0.031051
H  -1.115702 2.263723 -0.020653
H  1.400984 2.644601 -0.049049
H  3.006612 -1.94972 -0.887788
H  3.02176 -1.92698 0.885063
H  1.825463 -2.941459 0.021719
H  -4.116598 0.721373 0.028327
