program: Gaussian 09
title: 000242825
version: EM64L-G09RevD.01
frameworkgroup: C1[X(C7H6N2O5)]
method: RPBEPBE
basis: SDD
operation: Freq
keyword: #pfreq=noraman
keyword: PBEPBE/SDD
title: #p freq=noraman PBEPBE/SDD
converged: YES YES NO NO
title: Mulliken charges:
elementType: O O O O O N N C C C C C C C H H H H H H
charge: -0.288341 -0.166579 -0.146139 -0.188571 -0.174970 0.043803 0.026462 0.151007 0.304148 0.299166 -0.340741 -0.368042 -0.172505 -0.514391 0.265435 0.296117 0.250177 0.249941 0.256495 0.217528
chargesum: 0.00000
title: Mulliken charges with hydrogens summed into heavy atoms:
elementType: O O O O O N N C C C C C C C
charge: -0.288341 -0.166579 -0.146139 -0.188571 -0.174970 0.043803 0.026462 0.151007 0.304148 0.299166 -0.075306 -0.071925 0.077672 0.209573
polarizability: 1.42645582e+02 3.61862713e+00 1.31133398e+02 3.15734063e+00 1.94274005e+00 6.29499837e+01
1716.lowfreq: -22.6780 -6.3220 -4.6313 -0.0005 0.0004 0.0011 8.6384 35.4205 74.1565
frequency: -18.7362 35.4158 74.1447 103.1042 149.8826 152.0028 163.9319 168.7643 213.4065 277.6513 312.2909 355.2715 375.1072 426.7046 492.9398 513.6703 564.8223 582.0882 658.0267 668.2014 698.0591 728.7422 736.8100 787.7759 810.9376 855.8185 924.5520 980.8673 990.1979 1049.6088 1103.9451 1109.7715 1149.7605 1160.4813 1189.8386 1208.9855 1228.9972 1240.8515 1372.4243 1379.8283 1401.6365 1427.0121 1432.0835 1456.4553 1458.6193 1472.7909 1576.2742 1596.3339 2976.8078 3079.0004 3140.8326 3155.7315 3173.0683 3191.3122
redmass: 3.1518 13.4607 5.6038 13.4651 4.3757 1.1186 6.6077 11.5967 6.5377 5.4265 8.4779 9.2570 5.9803 9.5659 6.3801 5.9951 5.1335 5.3535 7.6329 9.3816 7.4293 5.2456 5.0124 8.0914 1.7027 7.9067 1.4113 5.3257 1.4796 3.5263 1.8877 1.4161 1.3305 1.6572 1.6519 10.6063 3.6330 5.3704 7.6989 9.0285 8.7787 1.4831 2.8864 1.1914 1.8047 1.0541 7.1995 7.5397 1.0315 1.1046 1.1022 1.0882 1.0944 1.0970
irintensity: 8.1893 0.5411 1.4609 0.0389 3.1517 0.5513 1.1416 0.7917 3.0161 4.7640 0.3838 1.0889 0.9914 9.0683 5.6890 3.3128 9.2652 5.9917 6.8375 7.2913 10.6712 17.4451 33.0760 9.9252 46.7900 25.8446 1.6022 51.8534 12.8413 6.8001 3.1859 2.3447 4.2454 4.1949 14.7815 269.0998 61.9181 117.5225 8.6810 116.9918 141.8646 38.9168 8.5797 44.7263 62.7417 16.4158 2.8553 16.0890 47.6594 23.2739 16.2785 4.1410 3.7427 4.4766
temp: 298.150 k
press: 1.00000 atm
elementType: 8 8 8 8 8 7 7 6 6 6 6 6 6 6 1 1 1 1 1 1
symmnumber: 1
zpe: 344127.6 jmol-1
zpe.correction: 0.131071 hartree
zpe.thermalcorrener: 0.143122 hartree
zpe.thermalcorrenthalpy: 0.144066 hartree
zpe.thermalcorrgfe: 0.091922 hartree
zpe.sumelectzpe: -754.734245 hartree
zpe.sumelectthermal: -754.722194 hartree
zpe.sumelectthermalent: -754.721250 hartree
zpe.sumelectthermalfe: -754.773394 hartree
dipole: -4.4313 6.4493 -1.4410
dipole: 7.9565
quadrupole: -79.2836 -77.9813 -82.9364
quadrupole: 0.4672 4.1211 -0.0810
quadrupole: 0.7835 2.0858 -2.8693 0.4672 4.1211 -0.0810
hfenergy: -754.8653158 hartree
pointgroup: C01 [X(C7H6N2O5)]
dipole: -2.0372572 2.3046243 -0.5807681 debye
dipolederiv: -1.2944227 -0.3790797 -0.2270865 -0.441385 -0.523273 -0.1287172 -0.1249907 -0.0291299 -0.39774 -0.2987957 -0.0628892 -0.1750013 -0.0850598 -0.5663102 -0.1707141 -0.1697122 -0.0062861 -0.6253266 -0.2496581 0.0102753 -0.1543106 0.0624023 -0.5414142 0.1844491 -0.109315 0.0782982 -0.6242293 -0.8192602 -0.1895372 -0.0793736 -0.1188677 -0.4954899 -0.106928 -0.03252 -0.096563 -0.2491773 -0.5508929 0.0697669 0.0244448 0.067624 -0.6293263 -0.1632306 -0.0011929 -0.1478476 -0.2259165 0.4015689 0.0751741 0.3464865 -0.0229624 1.0732726 -0.0250354 0.263142 -0.0784045 1.1631153 1.6021093 -0.0393409 0.0481895 -0.1766916 0.9820267 0.3308994 0.0142244 0.2680673 0.2782354 0.0713292 -0.2622159 -0.0624661 0.1674673 0.0150004 -0.0336104 -0.0093876 -0.0290095 -0.0495482 0.9321863 0.4635726 0.048427 0.6638968 0.2253949 0.0818612 -0.1027719 -0.115192 0.0031553 -0.4875708 0.223082 0.0063358 0.2413468 0.0512025 -0.0608904 0.0063825 0.0202833 0.0803091 0.0130274 0.017294 -0.0365996 -0.2782382 -0.0276863 -0.0141415 0.006793 0.0174447 -0.1109925 -0.0216145 0.0876743 -0.0010388 -0.1592707 -0.1545843 0.002902 -0.0414222 0.0236434 -0.1053518 -0.0855585 -0.1356493 -0.0008103 -0.0040759 0.1768197 0.0044725 -0.0136365 0.0143546 -0.1148213 0.6456702 0.1278572 0.2068373 0.0348827 0.2856984 0.0597743 0.3814892 0.139291 0.4369279 -0.0188585 0.0483847 0.0121432 0.0364481 0.090003 0.0026579 0.0179453 0.0067795 0.1555341 0.0780412 -0.0467514 0.0056357 -0.0157296 0.1081067 0.0064666 0.019592 -0.0168585 0.1733407 0.0803151 0.0122483 0.0033013 0.017295 -0.0655566 -0.0061782 0.0012041 -0.0041078 0.1582432 -0.0523086 -0.0950013 0.0075879 -0.1185296 0.0544822 0.0225579 0.0328445 0.0383718 0.0666345 0.0196817 0.056981 0.0897345 0.0237901 0.0513796 -0.0767911 -0.0435434 -0.0890505 -0.031759 0.0350111 0.0181543 -0.0624368 0.1056574 -0.1097458 0.090196 -0.0951246 0.0059158 0.0193672 unknown
polarizability: 140.8542492|4.549836|131.9376907|7.614023|5.8025957|63.9370246 unknown
InChI: InChI=1S/C7H6N2O5/c1-14-6-4-2-3-5(8(10)11)7(6)9(12)13/h2-4H,1H3
charge 0 multiplicity 1
20 atoms
O  -2.52135 -0.454761 0.295392
O  -0.486394 -2.281659 -0.970733
O  0.317785 -2.244536 1.169481
O  3.37665 0.853382 0.186178
O  2.49872 -1.147721 -0.475773
N  -0.069213 -1.681609 0.086916
N  2.386206 0.074809 -0.085114
C  -0.126439 -0.191562 0.066359
C  -1.417904 0.388502 0.133479
C  1.015565 0.640662 0.0333
C  -1.550474 1.796965 0.144578
C  0.884147 2.044699 0.054593
C  -0.403326 2.617545 0.106328
C  -3.386392 -0.636043 -0.89734
H  -2.552872 2.230175 0.218494
H  1.789881 2.655398 0.027817
H  -0.51057 3.706077 0.124412
H  -4.231566 -1.245226 -0.547439
H  -2.824897 -1.17221 -1.682817
H  -3.750057 0.338412 -1.274709
