program: Gaussian 09
title: 000242823
version: EM64L-G09RevD.01
frameworkgroup: C1[X(C6H8N2O2)]
method: RPBEPBE
basis: SDD
operation: Freq
keyword: #pfreq=noraman
keyword: PBEPBE/SDD
title: #p freq=noraman PBEPBE/SDD
converged: NO YES NO NO
title: Mulliken charges:
elementType: O O N N C C C C C C H H H H H H H H
charge: -0.211341 -0.230285 -0.434922 -0.407648 0.285227 -0.487949 -0.487893 -0.444944 0.135577 0.159842 0.217905 0.263077 0.263081 0.217911 0.255849 0.235711 0.320801 0.350000
chargesum: 0.00000
title: Mulliken charges with hydrogens summed into heavy atoms:
elementType: O O N N C C C C C C
charge: -0.211341 -0.230285 -0.114122 -0.057648 0.285227 -0.006966 -0.006900 0.046617 0.135577 0.159842
polarizability: 1.06372487e+02 -3.43045463e+00 7.63657301e+01 -7.28439524e-04 2.60431057e-03 5.59675539e+01
1716.lowfreq: -11.9936 -9.6190 -7.5858 0.0004 0.0004 0.0008 84.3347 109.7351 160.3111
frequency: 84.3317 109.7224 160.3111 196.2308 266.1934 343.7020 401.9299 441.9574 495.2015 561.5988 609.7785 641.8659 696.5936 699.1623 730.7110 733.7603 791.2357 851.9426 916.7681 949.2570 959.8431 972.2256 1012.5030 1037.2913 1105.3671 1171.0228 1187.0576 1187.4402 1232.6574 1242.7471 1264.8079 1281.0018 1302.5225 1314.8879 1374.5404 1444.6881 1454.4988 1469.5820 1675.6941 1723.4334 3018.7920 3021.8436 3044.8540 3095.0884 3100.8007 3124.7500 3591.0178 3606.9587
redmass: 5.0387 2.3484 9.4490 2.5491 2.8052 7.9303 4.5227 6.0877 1.1434 3.2726 11.9735 1.1476 7.7827 1.6705 4.4924 5.7133 1.3095 1.9176 2.3659 2.6676 3.3400 2.7531 7.7051 1.0791 3.6065 3.0758 1.6829 1.2780 1.2358 1.5930 1.3355 2.6766 2.1650 3.9966 1.8052 1.0835 1.0943 1.1199 8.2925 9.3058 1.0590 1.0605 1.0615 1.1077 1.1068 1.1077 1.0803 1.0801
irintensity: 0.3552 0.2705 2.5116 0.6882 2.9504 13.0847 0.5378 8.1477 92.4685 8.6052 12.0863 149.5863 0.1833 8.3422 19.1410 58.7540 0.4856 1.3591 2.5410 3.1733 15.9374 8.4730 6.9892 0.6810 46.7335 4.6517 24.1837 0.5050 0.0680 1.4774 5.6335 121.0386 111.7241 121.8428 2.5740 11.6784 2.1340 16.8263 467.9740 442.1849 40.8165 15.6133 36.0386 8.2239 10.9816 34.0047 71.4417 37.5377
temp: 298.150 k
press: 1.00000 atm
elementType: 8 8 7 7 6 6 6 6 6 6 1 1 1 1 1 1 1 1
symmnumber: 1
zpe: 369049.0 jmol-1
zpe.correction: 0.140563 hartree
zpe.thermalcorrener: 0.149187 hartree
zpe.thermalcorrenthalpy: 0.150131 hartree
zpe.thermalcorrgfe: 0.106885 hartree
zpe.sumelectzpe: -492.656675 hartree
zpe.sumelectthermal: -492.648051 hartree
zpe.sumelectthermalent: -492.647107 hartree
zpe.sumelectthermalfe: -492.690353 hartree
dipole: -2.5238 -2.1946 -0.0004
dipole: 3.3445
quadrupole: -68.8376 -58.3998 -57.3242
quadrupole: 10.3032 0.0012 -0.0015
quadrupole: -7.3171 3.1208 4.1963 10.3032 0.0012 -0.0015
hfenergy: -492.7972379 hartree
pointgroup: C01 [X(C6H8N2O2)]
dipole: 1.0001646 0.8550554 -0.0002943 debye
dipolederiv: -0.6876054 0.255733 -0.0002618 0.29288 -0.9646237 0.0004284 -0.0005144 0.0008294 -0.3389174 -1.4196936 0.1619893 0.0001061 0.2963619 -0.5836555 0.0000574 -0.0015991 0.0003204 -0.3628207 -1.1721971 -0.2723556 -0.0003693 -0.2187917 -0.5022533 -0.0002009 0.000312 0.0000398 -0.5032375 -1.15653 0.564977 -0.00086 0.3106148 -0.8781852 0.000545 -0.0003625 -0.0000521 -0.3483359 0.406473 -0.2875559 0.0004745 -0.4858682 -0.1438331 0.0001073 0.0004062 0.0002181 0.2516244 -0.0307282 0.0538496 -0.0447433 0.0106059 0.1252655 0.0350239 0.0123089 0.0323837 0.0424827 -0.0309973 0.0539601 0.0445376 0.0106135 0.1251081 -0.0351412 -0.01257 -0.0324398 0.0425118 0.0701727 0.0987773 0.0000064 0.0236423 0.1099517 -0.0000659 0.0000174 -0.0000556 -0.0385317 1.5018727 -0.4639895 0.0009397 -0.0648186 1.0979867 -0.000689 0.0007802 -0.0011358 0.1715191 2.0798536 -0.1157411 0.000097 -0.2414329 1.4943261 -0.0004793 0.0011678 -0.0004796 0.2858754 0.0461248 0.0183762 -0.0081852 0.0124827 -0.1197227 0.0960335 -0.0020905 0.0544139 0.0422309 0.0446976 -0.0177636 -0.0147162 0.0092225 0.024637 -0.1258443 0.0082526 -0.0554593 -0.081649 0.0446799 -0.0178202 0.0148836 0.0090784 0.0248229 0.1257508 -0.0081312 0.0553052 -0.0818104 0.0461056 0.0183806 0.0081416 0.0125751 -0.1198184 -0.0958098 0.0020804 -0.0542368 0.0424107 0.0532897 0.0430931 -0.000028 0.1049811 -0.0642264 0.0001186 -0.0000651 0.000098 0.074057 -0.1220706 -0.1048539 -0.0000259 -0.1544999 0.0038436 -0.0000351 0.0000003 -0.0000066 0.0762128 0.1487076 -0.0132508 0.0000219 0.0110899 0.1728453 0.00014 -0.0000074 0.000151 0.3576342 0.177845 0.0241944 -0.0000189 0.0612632 0.1975316 0.0000607 0.0000146 0.0001062 0.3687433 unknown
polarizability: 106.3128322|-3.6815876|76.4253608|0.0249497|-0.0175752|55.9675782 unknown
InChI: InChI=1S/C6H8N2O2/c9-4-6(2-1-3-6)8-5(10)7-4/h7-8H,1-3H2
charge 0 multiplicity 1
18 atoms
O  0.64429 -2.13347 0.001848
O  -3.069976 0.778651 -0.001977
N  -0.713154 1.160099 -0.001233
N  -1.422214 -0.961447 -0.000344
C  0.517765 0.372225 -0.000127
C  1.62135 0.62275 -1.09912
C  1.620268 0.624008 1.099662
C  2.720287 0.433669 0.00092
C  -0.028572 -1.074182 0.000207
C  -1.876917 0.399156 -0.000303
H  1.567507 1.65952 -1.477011
H  1.626736 -0.077854 -1.948675
H  1.624756 -0.075717 1.949943
H  1.566171 1.661182 1.476425
H  3.119721 -0.592429 0.001689
H  3.551726 1.155019 0.000893
H  -0.746793 2.177416 -0.002266
H  -2.071351 -1.748297 -0.000333
