program: Gaussian 09
title: 000242818
version: EM64L-G09RevD.01
frameworkgroup: C1[X(C4H4O4)]
method: RPBEPBE
basis: SDD
operation: Freq
keyword: #p
keyword: freq=noraman
keyword: PBEPBE/SDD
title: #p freq=noraman PBEPBE/SDD
converged: NO YES NO NO
title: Mulliken charges:
elementType: O O O O C C C C H H H H
charge: -0.203884 -0.203916 -0.172989 -0.172955 -0.636417 -0.203101 0.250887 0.250796 0.307582 0.276623 0.233102 0.274274
chargesum: 0.00000
title: Mulliken charges with hydrogens summed into heavy atoms:
elementType: O O O O C C C C
charge: -0.203884 -0.203916 -0.172989 -0.172955 -0.052212 0.304274 0.250887 0.250796
polarizability: 6.23134245e+01 8.90287679e-04 6.00554407e+01 3.83302413e-03 9.48182330e-01 3.50376826e+01
1716.lowfreq: -16.1608 -14.2544 -0.0006 -0.0003 0.0009 8.1159 99.1875 123.9489 257.2087
frequency: 99.1801 123.9486 257.2078 389.6539 408.0033 418.8678 526.3311 548.4716 554.3432 705.1547 769.6140 782.2471 889.5414 927.7495 975.1758 1041.0709 1071.7156 1163.4070 1182.9260 1202.3098 1269.7451 1368.9155 1420.9315 1465.0272 1701.2388 1727.3249 2983.0242 3006.0149 3125.1966 3168.8751
redmass: 4.3810 11.6483 2.3124 7.3380 3.0474 9.9229 6.7816 4.2590 6.1681 7.5540 6.1026 3.9452 10.8473 2.6473 8.9736 4.4974 1.7724 1.2424 6.8451 1.0584 1.3634 1.2018 1.0728 1.0797 10.9818 12.7324 1.0681 1.0666 1.0929 1.1025
irintensity: 12.9404 2.3065 10.9702 6.8402 9.3469 0.8904 0.7697 1.2747 2.0330 8.2125 49.8754 0.0285 181.4379 9.8218 49.8536 34.7277 1.8387 21.9539 428.9752 9.3765 8.4709 2.8764 31.3250 7.7150 410.4158 190.9758 0.9714 48.6378 0.1047 4.2858
temp: 298.150 k
press: 1.00000 atm
elementType: 8 8 8 8 6 6 6 6 1 1 1 1
symmnumber: 1
zpe: 210980.7 jmol-1
zpe.correction: 0.080358 hartree
zpe.thermalcorrener: 0.087167 hartree
zpe.thermalcorrenthalpy: 0.088111 hartree
zpe.thermalcorrgfe: 0.048966 hartree
zpe.sumelectzpe: -455.100650 hartree
zpe.sumelectthermal: -455.093841 hartree
zpe.sumelectthermalent: -455.092897 hartree
zpe.sumelectthermalfe: -455.132042 hartree
dipole: -0.0008 1.7494 3.3543
dipole: 3.7831
quadrupole: -64.7973 -41.7634 -42.4109
quadrupole: -0.0006 -0.0073 0.1120
quadrupole: -15.1400 7.8938 7.2463 -0.0006 -0.0073 0.1120
hfenergy: -455.1810079 hartree
pointgroup: C01 [X(C4H4O4)]
dipole: -0.0003979 0.6507027 1.3385999 debye
dipolederiv: -0.7300829 0.1118165 0.028885 0.526997 -1.2091955 -0.0947236 0.0333983 0.0467008 -0.335211 -0.7303206 -0.1120814 -0.0286451 -0.5266265 -1.208674 -0.0951735 -0.0329493 0.0478612 -0.3348864 -0.9185685 0.3319214 0.1182578 0.2709732 -0.6709235 -0.0417145 0.2197168 -0.0930666 -0.3427432 -0.9181952 -0.3312504 -0.1174823 -0.2716052 -0.6710278 -0.0413669 -0.2213866 -0.0940311 -0.3427097 -0.5265459 0.0000039 -0.0001297 -0.0000346 -0.1772135 0.0999135 0.0011424 0.1367588 -0.0028531 1.1189987 -0.0003112 -0.0001887 -0.0001934 0.6542237 0.1488152 0.0000248 0.1786975 0.6005844 1.263273 -0.2541441 -0.2777115 -0.489642 1.5513615 0.0323559 -0.3194495 -0.0604075 0.3317225 1.2632682 0.254012 0.2770061 0.4901361 1.5511258 0.0323088 0.3195828 -0.0602399 0.3310065 0.0704857 0.0000244 -0.000026 -0.0000377 0.0175528 -0.0106311 0.0000167 -0.0311048 0.1426391 0.0969728 -0.0000707 0.0000015 -0.0000613 0.1412972 -0.0763792 -0.0000957 -0.031947 0.0119249 -0.0573556 0.0000941 0.0000567 0.0000568 0.054938 0.0420179 0.0000004 -0.0855814 -0.15032 0.0680701 -0.0000145 -0.0000239 0.0000378 -0.0334648 0.0045777 -0.0000011 0.0463601 0.0908461 unknown
polarizability: 62.313424|0.000728|59.9818886|0.0053513|1.6534058|35.1112352 unknown
InChI: InChI=1S/C4H4O4/c5-3-1-4(6)8-2-7-3/h1-2H2
charge 0 multiplicity 1
12 atoms
O  1.220103 1.029427 -0.214728
O  -1.220096 1.02939 -0.214671
O  2.311979 -0.995057 -0.34078
O  -2.311503 -0.995294 -0.341924
C  -0.000008 -0.996741 0.523911
C  0.00001 1.672351 0.288301
C  1.285733 -0.378045 -0.037729
C  -1.286387 -0.377832 -0.035984
H  -0.000128 -2.078934 0.332731
H  0.000509 -0.854461 1.625397
H  -0.000055 1.661739 1.395283
H  0.000044 2.690056 -0.117808
