program: Gaussian 09
title: 000242816
version: EM64L-G09RevD.01
frameworkgroup: C1[X(C9H8Cl3NO)]
method: RPBEPBE
basis: SDD
operation: Freq
keyword: #p
keyword: freq=noraman
keyword: PBEPBE/SDD
title: #p freq=noraman PBEPBE/SDD
converged: YES YES NO NO
title: Mulliken charges:
elementType: Cl Cl Cl O N C C C C C C C C C H H H H H H H H
charge: -0.025663 -0.041102 -0.057383 -0.226905 -0.443471 -0.518567 0.523020 0.329071 -0.552591 -0.434583 -0.354105 -0.047394 -0.189540 -0.249179 0.303599 0.322050 0.312923 0.288479 0.251746 0.311720 0.237206 0.260669
chargesum: 0.00000
title: Mulliken charges with hydrogens summed into heavy atoms:
elementType: Cl Cl Cl O N C C C C C C C C C
charge: -0.025663 -0.041102 -0.057383 -0.226905 -0.121421 -0.214967 0.523020 0.329071 0.048811 -0.182837 -0.042385 -0.047394 0.047666 0.011490
polarizability: 2.00874675e+02 1.36166637e+00 1.20306822e+02 -9.25434166e+00 1.30601828e+01 1.03350941e+02
1716.lowfreq: -5.2020 -1.7865 0.0016 0.0020 0.0029 3.0733 15.1092 36.9023 71.9842
frequency: 14.8836 36.8726 71.9811 82.1339 93.5266 153.7140 159.5841 185.2229 208.2432 255.1625 279.5169 300.3852 350.8064 371.7663 409.8632 438.5833 552.7391 580.0670 588.7217 641.9275 652.6169 662.2199 685.3019 699.0541 754.9798 793.8047 853.3652 864.5490 892.3948 916.7250 969.6247 979.3939 993.9932 1073.5716 1097.4909 1098.5627 1138.4811 1157.7008 1180.4277 1192.0802 1251.1843 1272.1661 1305.0676 1344.6036 1377.1271 1411.1510 1431.0407 1471.8164 1517.4566 1589.4259 1610.5646 1634.0069 3078.0768 3085.7585 3142.9879 3151.0322 3178.8767 3180.2463 3203.4792 3522.8383
redmass: 15.2944 8.3086 6.4735 11.2280 11.4596 4.2992 10.7497 5.3526 7.4263 5.0861 6.0295 8.7305 5.1628 5.4643 8.6303 3.0564 4.2698 5.4068 4.8378 1.5625 4.1914 7.3369 2.2598 4.8953 6.6555 1.3337 5.5028 1.6015 3.4517 1.3728 1.9766 5.9471 1.3199 2.1430 2.0901 1.5778 1.6557 1.1954 1.0886 1.7525 1.7914 1.1954 1.5421 1.6148 4.9352 3.2858 1.1077 2.6472 2.1517 4.9892 6.3395 5.5763 1.0862 1.0578 1.0927 1.0890 1.1126 1.0959 1.0955 1.0766
irintensity: 0.0106 0.9978 3.7108 3.7034 0.8917 5.0473 6.4426 0.4645 2.1152 2.5774 5.6216 1.0800 26.8632 16.3921 5.3054 8.7042 20.0668 18.4347 4.8718 57.4953 34.6520 32.6776 23.7430 8.6756 4.9899 51.9088 42.0983 43.2922 9.1668 4.6031 5.2139 7.8471 3.7359 23.6761 6.1254 15.7515 27.0936 27.0723 0.6721 18.5547 12.6926 3.6480 22.7865 10.3096 69.1589 52.0296 40.1601 120.8614 170.9396 187.1262 59.5841 138.7865 4.6210 9.2476 3.9909 7.7653 0.2089 2.6633 6.7805 18.3143
temp: 298.150 k
press: 1.00000 atm
elementType: 17 17 17 8 7 6 6 6 6 6 6 6 6 6 1 1 1 1 1 1 1 1
symmnumber: 1
zpe: 401891.1 jmol-1
zpe.correction: 0.153072 hartree
zpe.thermalcorrener: 0.166921 hartree
zpe.thermalcorrenthalpy: 0.167865 hartree
zpe.thermalcorrgfe: 0.109073 hartree
zpe.sumelectzpe: -1856.907277 hartree
zpe.sumelectthermal: -1856.893428 hartree
zpe.sumelectthermalent: -1856.892484 hartree
zpe.sumelectthermalfe: -1856.951276 hartree
dipole: -0.0700 1.2291 1.0167
dipole: 1.5966
quadrupole: -105.2795 -105.1971 -103.4571
quadrupole: 9.1388 5.6887 6.9562
quadrupole: -0.6349 -0.5525 1.1875 9.1388 5.6887 6.9562
hfenergy: -1857.0603489 hartree
pointgroup: C01 [X(C9H8Cl3N1O1)]
dipole: 0.0121523 0.5927183 -0.2076882 debye
dipolederiv: -0.3893728 0.0274187 -0.032402 0.1476411 -0.404571 -0.2684649 0.115 -0.262827 -0.416448 -0.2559426 -0.0752142 -0.0743476 -0.0847102 -0.2790427 -0.1805396 -0.1109822 -0.2108953 -0.4550731 -0.5755227 -0.2686858 0.1524086 -0.3591283 -0.3403503 0.1452448 0.1908284 0.1374905 -0.1447743 -0.762011 0.0313262 -0.0023391 -0.5655761 -0.6745519 0.1879272 0.3036909 0.1829149 -0.3919804 -1.723119 -0.0519451 0.1171546 -0.1333426 -0.3105999 0.0377864 0.1410044 0.0264936 -0.3133472 0.3407361 0.0347646 0.065963 -0.0585747 0.3163226 0.3182889 -0.094124 0.3149098 0.5146297 1.039379 -0.1430662 0.0207795 -0.3689927 0.1837739 -0.0119336 0.1225457 -0.0229487 0.1208962 1.5933648 0.0490348 -0.1900803 0.7619199 0.7881233 -0.3174411 -0.567407 -0.2933672 0.2676043 0.1043001 0.0596877 0.0866256 0.1170488 0.2421124 0.2402791 0.0851056 0.2002349 0.4852934 -0.4786981 -0.0533031 0.0397493 -0.1444623 -0.118494 -0.0151566 0.0761874 -0.0140698 -0.1614463 -0.2671408 0.0335424 -0.0064281 0.1706546 -0.1503581 -0.0112169 -0.0714964 -0.006131 -0.1561711 0.8783401 0.3851909 -0.2254189 0.6090038 0.5116997 -0.2921448 -0.3235282 -0.2723392 0.1059413 0.1723364 0.0356358 -0.0321992 -0.0842227 0.1236874 -0.1060164 0.0231415 -0.1158797 -0.0752612 -0.2736128 -0.1376114 0.0736818 -0.1770708 -0.2473957 0.062424 0.0879009 0.0589029 -0.1676895 -0.000188 -0.0292507 0.0453796 0.0238942 -0.0243513 0.0023391 0.0508387 0.032552 -0.0475347 0.1786745 -0.0109764 0.01059 0.0385384 0.1395974 0.0594395 -0.0172115 0.0600024 0.2576466 0.1992797 0.0034113 -0.0163709 -0.0605229 0.033547 -0.0193481 0.0299517 0.0133461 -0.0157632 -0.0232254 0.046277 -0.0253314 0.0784022 0.0365578 -0.056837 -0.0205998 -0.0537963 0.013348 0.0788243 0.056054 -0.0208177 0.0546801 -0.0004329 0.0760894 -0.0195735 0.0741901 0.1404073 0.1338314 -0.0558612 0.0265093 -0.0386897 0.1141777 0.0320916 0.0161961 0.0335334 0.1641636 0.0585893 0.0199904 -0.0040626 0.040691 -0.0467412 0.088199 -0.0131891 0.0891929 0.1135143 -0.0288224 0.0435803 -0.0090434 0.032819 0.1072898 0.02899 -0.0042797 0.0284907 0.1620443 unknown
polarizability: 200.717897|3.8356382|126.9096874|-9.0816903|-4.6498415|96.9048527 unknown
InChI: InChI=1S/C9H8Cl3NO/c10-5-8(12)9(14)13-7-3-1-2-6(11)4-7/h1-4,8,13H,5H2
charge 0 multiplicity 1
22 atoms
Cl -3.131958 1.95914 1.425434
Cl -4.086318 -0.817418 -1.961432
Cl 4.619621 1.476428 -0.861614
O  -1.763641 -1.194416 0.747406
N  -0.444659 0.529572 -0.166756
C  -2.875569 0.817949 -0.097876
C  0.875869 0.022154 -0.000846
C  -1.645937 -0.061423 0.203198
C  -4.151192 0.00958 -0.261477
C  1.9422 0.855429 -0.436565
C  1.151326 -1.251581 0.56432
C  3.261605 0.397587 -0.297977
C  2.492926 -1.671248 0.684861
C  3.568476 -0.858815 0.258426
H  -2.724258 1.520537 -0.932783
H  -0.506268 1.464543 -0.578259
H  -4.207277 -0.803516 0.474949
H  -5.048237 0.641815 -0.263998
H  1.746392 1.841278 -0.873002
H  0.32777 -1.885614 0.894881
H  2.707143 -2.652955 1.119886
H  4.605682 -1.189924 0.354424
