program: Gaussian 09
title: 000242815
version: EM64L-G09RevD.01
frameworkgroup: C1[X(C17H18N2O5)]
method: RPBEPBE
basis: SDD
operation: Freq
keyword: #p
keyword: freq=noraman
keyword: PBEPBE/SDD
title: #p freq=noraman PBEPBE/SDD
converged: YES YES NO NO
title: Mulliken charges:
elementType: O O O O O N N C C C C C C C C C C C C C C C C C H H H H H H H H H H H H H H H H H H
charge: -0.308584 -0.289213 -0.303324 -0.327588 -0.217910 -0.467896 0.044105 0.047394 0.254201 0.300667 0.521154 -0.554628 -0.541090 -0.341581 0.482188 -0.523701 -0.523090 -0.525673 -0.435793 -0.353577 -0.195309 -0.208701 -0.256228 0.253783 0.254420 0.298391 0.249732 0.228785 0.260840 0.233339 0.221050 0.296728 0.230870 0.215375 0.263425 0.232925 0.247810 0.226631 0.326263 0.226786 0.227574 0.229449
chargesum: 0.00000
title: Mulliken charges with hydrogens summed into heavy atoms:
elementType: O O O O O N N C C C C C C C C C C C C C C C C C
charge: -0.308584 -0.289213 -0.303324 -0.327588 -0.217910 -0.141633 0.044105 0.047394 0.254201 0.300667 0.521154 -0.300208 -0.242699 -0.091849 0.482188 0.199263 0.186580 0.181693 -0.214743 -0.056849 0.031478 0.018873 -0.026779 0.253783
polarizability: 4.39478588e+02 -3.22377765e+00 2.25046816e+02 1.68413634e+00 -1.90739504e+00 1.06687303e+02
1716.lowfreq: -7.3516 -0.0008 0.0005 0.0009 4.4007 6.4168 17.3240 20.0036 30.6799
frequency: 17.2696 18.4351 30.6797 46.5310 62.4213 68.7290 75.0471 81.0205 87.5881 103.5426 118.9042 143.2338 151.5090 156.7697 161.9071 170.0897 187.4308 202.2788 220.0031 245.6895 248.1199 276.9044 310.4260 327.4473 336.5164 354.7381 368.9215 397.4101 408.5126 441.6220 488.8735 508.4822 518.0722 583.9350 588.8035 613.2128 628.2987 634.4709 644.4847 655.3302 685.7734 696.5644 705.4574 764.6131 767.1948 772.0423 822.2070 841.5987 865.8390 879.7126 895.7075 910.8876 914.6129 914.6980 932.2087 940.6512 965.0419 972.1731 984.7423 996.9443 1020.9528 1028.2110 1037.4151 1089.8141 1108.4798 1110.8695 1111.0857 1122.8606 1125.6920 1148.8854 1155.8665 1158.6862 1173.2102 1191.0828 1191.7979 1212.0435 1258.4874 1287.3658 1325.3854 1336.3275 1363.6000 1385.4763 1397.3495 1415.4976 1432.2202 1433.4096 1434.9627 1455.8819 1458.1965 1460.6649 1466.2516 1475.8435 1482.9832 1485.6694 1486.0965 1511.4235 1544.7121 1576.7442 1601.6347 1605.1856 1618.0016 1717.0427 2973.8957 2977.0776 2981.8668 3067.9286 3071.4207 3084.3545 3085.5026 3112.9917 3123.7843 3125.6397 3130.0360 3133.2572 3145.1726 3152.8489 3165.9070 3175.3004 3189.6363 3538.1703
redmass: 5.2378 4.8445 5.5765 4.5489 3.0674 5.1467 3.0218 3.4137 3.2767 4.9639 3.9982 2.5397 2.2796 1.6622 1.4331 1.2243 4.4099 4.3491 4.2251 4.5581 4.3640 6.0630 5.0044 5.2037 6.4880 6.3765 5.9228 8.5777 2.9222 5.9141 5.7986 2.8156 5.7554 7.0787 5.9075 6.3081 5.2457 1.3121 3.7693 5.1273 5.7748 2.0492 7.0714 6.0009 1.6704 4.1428 5.9720 1.2646 4.2940 1.8204 8.0656 4.4211 1.6153 1.5626 8.0632 8.7440 1.5357 1.3546 6.1814 1.3049 3.1714 2.1950 6.2578 1.5901 1.2603 1.2375 1.2436 3.2273 2.9492 1.3572 1.4720 1.4473 1.0498 1.1120 2.0145 1.4331 2.0807 2.0326 1.4161 3.7016 4.3163 6.7966 2.7992 1.2828 2.0951 1.3610 1.4272 1.2041 1.0573 1.1057 2.0520 1.0666 1.0561 1.0598 2.1551 2.1967 7.1549 7.1277 5.3190 6.7295 6.0633 10.0717 1.0307 1.0339 1.0296 1.0903 1.1045 1.1046 1.0992 1.0885 1.1025 1.1037 1.1046 1.0869 1.0935 1.0919 1.0995 1.0930 1.0954 1.0760
irintensity: 3.0300 0.1930 1.4860 0.7818 2.7777 4.9707 3.2201 3.4917 9.6841 1.0559 1.3960 2.6138 2.7860 2.6241 2.7091 0.0928 2.5557 8.0779 5.3735 12.6561 8.6554 10.3572 3.1882 5.4138 3.6609 7.5060 13.7182 0.5196 0.0044 3.1299 4.2049 29.2979 0.5553 2.6633 2.2339 0.2720 5.1687 40.0036 5.6207 26.2782 25.6140 52.5128 25.3150 16.7818 104.2668 7.7628 82.4502 0.2783 5.7234 16.2984 13.1477 510.4673 115.1427 112.3970 434.3206 134.6961 44.1457 0.0963 1.7157 2.5041 12.8918 1.8178 157.6762 79.6081 33.3204 9.5120 3.4428 429.3460 97.5691 3.4145 7.7550 14.6094 0.5680 2.0459 25.1716 16.6131 16.9668 192.5364 94.1638 138.2963 43.3591 76.6936 66.6037 4.6924 196.0150 16.9595 17.0570 23.2441 16.5166 11.0347 40.8919 2.1815 21.7652 42.8714 5.6821 670.0929 84.7712 32.0165 36.6297 9.4392 107.9257 207.6301 61.4560 102.9130 68.6610 12.6557 26.1528 16.7684 35.5215 14.6175 22.4196 24.2512 15.4221 0.2442 30.3956 2.7331 28.2174 2.3035 6.6557 27.2625
temp: 298.150 k
press: 1.00000 atm
elementType: 8 8 8 8 8 7 7 6 6 6 6 6 6 6 6 6 6 6 6 6 6 6 6 6 1 1 1 1 1 1 1 1 1 1 1 1 1 1 1 1 1 1
symmnumber: 1
zpe: 844267.4 jmol-1
zpe.correction: 0.321564 hartree
zpe.thermalcorrener: 0.345850 hartree
zpe.thermalcorrenthalpy: 0.346794 hartree
zpe.thermalcorrgfe: 0.264443 hartree
zpe.sumelectzpe: -1142.385868 hartree
zpe.sumelectthermal: -1142.361583 hartree
zpe.sumelectthermalent: -1142.360638 hartree
zpe.sumelectthermalfe: -1142.442990 hartree
dipole: 2.6964 -2.5669 -1.0288
dipole: 3.8623
quadrupole: -98.4379 -129.8839 -140.8722
quadrupole: 15.4909 -4.1820 -0.2685
quadrupole: 24.6267 -6.8192 -17.8076 15.4909 -4.1820 -0.2685
hfenergy: -1142.7074322 hartree
pointgroup: C01 [X(C17H18N2O5)]
dipole: 1.0541855 0.9999311 0.4448373 debye
polarizability: 439.4499341|3.2390559|225.0703233|3.4949616|0.9558598|106.6924488 unknown
InChI: InChI=1S/C17H18N2O5/c1-21-14-9-12(10-15(22-2)16(14)23-3)11-18-24-17(20)19-13-7-5-4-6-8-13/h4-11,19H,1-3H3
charge 0 multiplicity 1
42 atoms
O  5.927996 -0.400232 -0.016415
O  5.080057 2.370701 0.09118
O  3.899031 -2.441274 -0.066918
O  -1.861041 0.83355 -0.020637
O  -2.889772 -1.332006 0.020443
N  -4.1014 0.706873 -0.062108
N  -0.563516 0.135791 -0.008619
C  4.557467 -0.064793 0.035494
C  4.168479 1.30259 0.114123
C  3.54611 -1.075429 0.019891
C  1.800341 0.632595 0.036407
C  2.796432 1.639281 0.108892
C  2.184664 -0.736263 0.005326
C  0.389475 1.04337 0.021645
C  -5.460321 0.284114 -0.065239
C  6.357661 -1.005474 -1.304745
C  6.189055 2.343939 1.071901
C  4.610828 -2.97731 1.117203
C  -6.456646 1.296287 -0.107385
C  -5.841817 -1.083064 -0.028573
C  -7.821916 0.946625 -0.112746
C  -7.213948 -1.414479 -0.034303
C  -8.210708 -0.412885 -0.076028
C  -2.971539 -0.093203 -0.018217
H  2.530078 2.700842 0.147518
H  1.430728 -1.527407 -0.028045
H  0.162348 2.121104 0.040345
H  7.425583 -1.237782 -1.175586
H  5.78121 -1.924363 -1.50965
H  6.222696 -0.275928 -2.123871
H  -6.162136 2.353429 -0.135966
H  -5.075021 -1.859766 0.002857
H  6.771057 3.254619 0.864562
H  5.784404 2.383118 2.101632
H  6.80921 1.44274 0.940998
H  4.828338 -4.028327 0.874325
H  5.547134 -2.420527 1.301721
H  3.955912 -2.92527 2.007249
H  -3.924489 1.713446 -0.093749
H  -8.580298 1.736594 -0.145552
H  -7.50332 -2.471003 -0.005932
H  -9.271304 -0.68522 -0.080129
