program: Gaussian 09
title: 000242814
version: EM64L-G09RevD.01
frameworkgroup: C1[X(C21H24O2S2)]
method: RPBEPBE
basis: SDD
operation: Freq
keyword: #p
keyword: freq=noraman
keyword: PBEPBE/SDD
title: #p freq=noraman PBEPBE/SDD
converged: YES YES NO NO
title: Mulliken charges:
elementType: S S O O C C C C C C C C C C C C C C C C C C C C C H H H H H H H H H H H H H H H H H H H H H H H H
charge: 0.155605 0.155587 -0.187470 -0.187455 -0.708189 0.499046 0.499036 0.475486 0.475427 -0.504058 -0.504097 -0.377035 -0.457030 -0.457062 -0.377002 -0.425083 -0.393641 -0.393564 -0.424913 -0.700487 -0.700444 -0.003709 -0.003701 -0.706746 -0.706749 0.225959 0.225993 0.222699 0.247716 0.247724 0.222697 0.241548 0.231482 0.231473 0.241517 0.230826 0.250139 0.250188 0.230826 0.275964 0.303915 0.275988 0.303871 0.242791 0.253841 0.252232 0.242789 0.253843 0.252229
chargesum: 0.00000
title: Mulliken charges with hydrogens summed into heavy atoms:
elementType: S S O O C C C C C C C C C C C C C C C C C C C C C
charge: 0.155605 0.155587 -0.187470 -0.187455 -0.256237 0.499046 0.499036 0.475486 0.475427 -0.033643 -0.033676 -0.135487 -0.225548 -0.225589 -0.135486 -0.194258 -0.143502 -0.143375 -0.194088 -0.120607 -0.120585 -0.003709 -0.003701 0.042118 0.042111
polarizability: 4.18241238e+02 5.14464347e-02 2.37074086e+02 2.04351580e+01 -3.90426603e-02 1.81004505e+02
1716.lowfreq: -7.9628 -3.4034 -1.3748 -0.0017 -0.0007 0.0008 2.5410 7.9507 20.2294
frequency: 2.4937 7.3113 20.2273 20.9764 24.2867 29.9368 31.4316 39.2302 40.2179 51.4796 62.0778 67.2398 70.5301 89.5313 101.7373 156.3772 174.8323 205.2676 211.1434 215.5590 231.2492 265.0462 280.6544 341.3683 341.8615 352.4288 358.9384 377.8178 384.8935 406.9880 408.0762 459.8802 461.7969 482.0481 501.7869 512.1664 513.0532 535.2204 578.6589 580.6192 597.5795 635.5274 637.3214 673.8884 683.2348 704.8722 729.1451 754.7741 756.1287 781.4812 794.2018 812.6637 828.5704 843.5805 854.2159 856.6611 865.9220 931.9841 961.5087 963.6041 964.4408 973.1762 977.5387 979.0184 988.1765 990.2468 1009.4301 1009.5243 1014.0894 1014.4365 1028.5181 1028.6351 1106.5823 1108.5416 1109.3704 1112.2082 1151.5230 1151.9547 1185.0099 1191.5225 1191.7754 1196.2238 1215.8694 1216.7572 1222.1187 1251.0290 1251.0910 1281.5242 1282.4699 1286.5730 1318.7799 1320.6264 1324.9013 1333.3243 1376.0601 1376.0863 1379.8766 1382.1197 1411.8370 1412.1020 1425.4155 1425.4946 1448.6152 1448.6439 1452.8238 1452.8373 1462.0045 1471.6763 1471.7510 1505.7236 1506.3915 1579.1342 1584.9004 1621.3279 1624.0863 1627.4343 1627.5197 2968.3247 2994.7250 2994.7439 3005.2038 3005.2654 3013.6031 3034.6145 3034.6459 3062.7662 3062.8328 3086.9695 3086.9884 3110.2432 3110.3550 3112.1078 3112.3999 3115.3032 3115.3320 3117.8068 3117.8124 3132.3979 3132.4187 3139.6182 3139.6905
redmass: 5.8206 4.6096 5.3498 3.9469 3.7672 1.9200 1.4962 3.6234 2.6627 6.0382 3.2632 2.7758 3.3261 2.8963 3.7958 6.1364 4.5900 3.0710 2.7411 4.4228 4.4866 4.3758 2.6472 4.1321 3.7143 3.3277 2.8440 2.5874 5.5086 2.8450 2.8635 8.8078 9.0111 3.4664 3.3068 3.5724 3.5076 4.4117 3.9687 4.0636 4.4150 6.8161 6.6009 5.3674 4.0972 3.7753 3.1666 1.2094 1.2360 2.5119 3.3672 3.2132 2.4203 2.7392 1.2473 1.2602 2.1156 1.6680 1.5348 2.0256 1.8014 1.6142 1.3850 1.3859 1.7958 1.7536 1.5811 1.5709 2.9857 2.9448 4.3619 4.3815 1.4411 2.3060 2.2906 1.3870 1.1026 1.0991 1.2022 1.4114 1.1105 2.0811 2.6606 2.2381 2.1958 1.2335 1.2341 1.2388 1.1834 1.5768 1.2810 1.3352 1.2812 1.3449 1.1916 1.1909 4.9911 5.9888 2.5945 2.5696 1.0849 1.0848 1.0491 1.0490 1.0700 1.0701 1.1094 1.0992 1.0989 2.6546 2.5446 6.6145 6.5051 6.3755 6.3900 9.5633 9.5459 1.0596 1.0357 1.0357 1.0595 1.0595 1.1000 1.0572 1.0572 1.1032 1.1032 1.0970 1.0970 1.0875 1.0875 1.0878 1.0879 1.1069 1.1068 1.1016 1.1016 1.0962 1.0962 1.0970 1.0969
irintensity: 0.0036 0.0203 0.0605 0.9753 0.0308 1.0200 3.4368 1.0980 0.4514 1.9915 0.0708 0.6912 0.5001 2.3273 0.3499 0.0025 4.0584 6.6914 0.4740 2.8908 3.3144 6.3775 6.1774 1.8259 0.3091 0.5740 0.2682 1.2628 0.4609 0.3495 0.0115 2.1940 1.0858 12.7558 14.0992 0.8180 5.3500 12.0530 9.0454 137.1523 9.0387 0.0622 0.1840 42.2903 26.2454 3.0511 5.5162 0.0595 4.5074 21.4724 2.9722 8.2807 24.6985 30.5015 0.0938 0.0491 16.4615 8.8719 3.5761 60.3602 11.6967 2.4968 0.2104 0.2569 11.2192 20.4105 1.9965 9.4774 1.3180 16.6573 6.0925 3.5648 13.8575 348.6029 18.8312 11.9657 8.9191 9.8633 1.5581 4.8662 1.3196 0.1727 0.3150 0.0745 2.4752 3.1285 2.2192 2.3748 2.1062 1.1112 2.3914 10.0935 0.1735 2.2884 83.1448 1.8340 1.1901 0.3786 4.4233 4.5723 1.9153 20.9507 15.4978 19.6376 4.5278 48.4209 14.2791 14.9322 7.4480 69.9398 10.0208 0.0307 2.1466 2.8194 0.4165 78.1245 223.7274 30.4393 3.5077 2.9625 29.6547 5.9721 12.4273 21.0856 14.2785 7.7502 7.4386 6.4633 6.5604 4.9199 7.0719 32.9782 13.4818 1.8901 3.7454 7.8065 8.8686 20.2512 42.0884 6.2100 0.3052
temp: 298.150 k
press: 1.00000 atm
elementType: 16 16 8 8 6 6 6 6 6 6 6 6 6 6 6 6 6 6 6 6 6 6 6 6 6 1 1 1 1 1 1 1 1 1 1 1 1 1 1 1 1 1 1 1 1 1 1 1 1
symmnumber: 1
zpe: 1030764.3 jmol-1
zpe.correction: 0.392597 hartree
zpe.thermalcorrener: 0.419825 hartree
zpe.thermalcorrenthalpy: 0.420769 hartree
zpe.thermalcorrgfe: 0.323842 hartree
zpe.sumelectzpe: -1759.398599 hartree
zpe.sumelectthermal: -1759.371372 hartree
zpe.sumelectthermalent: -1759.370428 hartree
zpe.sumelectthermalfe: -1759.467355 hartree
dipole: 0.0004 -1.4486 0.0021
dipole: 1.4486
quadrupole: -128.8046 -163.3774 -163.9496
quadrupole: 0.0020 -4.3466 0.0076
quadrupole: 23.2393 -11.3335 -11.9058 0.0020 -4.3466 0.0076
hfenergy: -1759.7911968 hartree
pointgroup: C01 [X(C21H24O2S2)]
dipole: 0.0005258 -0.5699322 0.0006617 debye
polarizability: 412.4729191|0.2401574|237.0742317|41.8654475|-0.0533834|186.7726783 unknown
InChI: InChI=1S/C21H24O2S2/c1-16(22)24-13-11-18-3-7-20(8-4-18)15-21-9-5-19(6-10-21)12-14-25-17(2)23/h3-10H,11-15H2,1-2H3
charge 0 multiplicity 1
49 atoms
S  -6.818935 -2.506523 -0.383496
S  6.824518 -2.489166 0.39187
O  -7.454686 -0.160988 -1.661092
O  7.454334 -0.140079 1.665879
C  -0.002975 2.526951 -0.006863
C  -1.284901 1.710245 0.151832
C  1.281474 1.713502 -0.161471
C  -3.727868 0.249134 0.514736
C  3.728895 0.257968 -0.51681
C  -5.020896 -0.540423 0.67519
C  5.024219 -0.528615 -0.673216
C  -1.363766 0.642879 1.082821
C  2.439615 2.038786 0.588267
C  -2.444765 2.029802 -0.597736
C  1.364332 0.643238 -1.088802
C  -2.565801 -0.074806 1.260941
C  3.64467 1.323347 0.415587
C  -3.647633 1.311638 -0.421305
C  2.568546 -0.071669 -1.263219
C  -5.175763 -1.568556 -0.469617
C  5.179432 -1.554176 0.473857
C  -7.899979 -1.242172 -1.21357
C  7.902155 -1.221302 1.220975
C  -9.356903 -1.660301 -1.277656
C  9.359737 -1.636721 1.287771
H  -0.118965 3.192956 -0.885561
H  0.110848 3.19766 0.86854
H  -5.038163 -1.066394 1.647208
H  -5.888726 0.14337 0.649268
H  5.890287 0.157378 -0.646922
H  5.044691 -1.056455 -1.644158
H  -0.47547 0.373943 1.666868
H  2.398456 2.863135 1.311481
H  -2.406685 2.85182 -1.323771
H  0.477445 0.369845 -1.672932
H  -2.606489 -0.891937 1.992426
H  4.530974 1.595281 1.002709
H  -4.535359 1.579113 -1.008329
H  2.612304 -0.891118 -1.991929
H  -4.390004 -2.341144 -0.443326
H  -5.166227 -1.063151 -1.44978
H  4.395213 -2.328342 0.447915
H  5.167485 -1.046876 1.453012
H  -9.511988 -2.696076 -0.937147
H  -9.721773 -1.551402 -2.314214
H  -9.955612 -0.980066 -0.644204
H  9.517433 -2.672124 0.947328
H  9.722365 -1.527485 2.325087
H  9.958404 -0.955129 0.655756
