program: Gaussian 09
title: 000242811
version: EM64L-G09RevD.01
frameworkgroup: C1[X(C17H22O)]
method: RPBEPBE
basis: SDD
operation: Freq
keyword: #pfreq=noraman
keyword: PBEPBE/SDD
title: #p freq=noraman PBEPBE/SDD
converged: YES YES NO NO
title: Mulliken charges:
elementType: O C C C C C C C C C C C C C C C C C H H H H H H H H H H H H H H H H H H H H H H
charge: -0.281334 0.377526 0.354466 -0.044037 -0.703119 -0.679540 -0.404698 -0.389462 -0.252020 0.572478 0.565261 -0.822382 -0.812343 -0.342019 -0.718944 -0.766841 -0.040528 -0.558249 0.220674 0.206122 0.218168 0.244128 0.237006 0.252275 0.224520 0.228972 0.211375 0.246654 0.221319 0.226609 0.242455 0.215021 0.207976 0.214621 0.216820 0.221263 0.220350 0.229755 0.221183 0.218521
chargesum: 0.00000
title: Mulliken charges with hydrogens summed into heavy atoms:
elementType: O C C C C C C C C C C C C C C C C C
charge: -0.281334 0.377526 0.354466 -0.044037 -0.276323 -0.217244 -0.167692 -0.137188 -0.027499 0.572478 0.565261 -0.135380 -0.121961 0.080977 -0.287503 -0.325228 0.189227 -0.118545
polarizability: 2.18193038e+02 3.11123847e-01 2.07389599e+02 -1.29236580e+01 1.99715816e+01 1.36542717e+02
1716.lowfreq: -11.2849 -8.1178 -0.0007 -0.0002 0.0006 6.8759 23.1710 23.8720 27.7923
frequency: 23.0739 23.4579 27.7788 46.6133 49.2797 65.1013 67.3655 98.9018 105.1968 113.3683 161.2017 173.8283 184.3558 213.7282 241.5088 268.1351 285.2694 322.4381 372.6687 376.4877 403.4849 413.3982 418.5255 447.7776 462.3987 492.9697 537.9300 541.9038 578.9387 611.7388 624.6369 668.4955 709.1944 727.4206 778.8031 790.8305 813.4837 821.4842 837.0543 898.6946 899.8990 914.3179 923.3842 932.6631 942.6914 944.8811 954.0801 958.2323 970.1864 972.0200 979.7838 989.2011 1008.2262 1017.8432 1027.8500 1048.3180 1051.3354 1074.0219 1145.2155 1150.1693 1168.2530 1178.6362 1189.7350 1211.0158 1249.1339 1252.7785 1280.0330 1281.2042 1290.4893 1294.8562 1299.4090 1343.8092 1373.7680 1392.6306 1393.2135 1427.0083 1427.7767 1430.4549 1441.5419 1451.6097 1455.6345 1457.0616 1464.0422 1465.8968 1475.8089 1477.4934 1480.2267 1590.7236 1596.0422 1665.3679 1668.7089 1671.0557 2941.4573 2963.2730 2969.1829 2972.0739 2976.3591 3008.0279 3027.7190 3039.4704 3045.6055 3064.7432 3085.8745 3086.1262 3088.3461 3089.2281 3091.3362 3116.7556 3116.9646 3126.8719 3152.9954 3188.5210 3192.5322 3201.4125
redmass: 3.1477 3.4635 3.8974 3.2519 2.9285 2.5000 2.5150 3.6707 3.6620 2.9095 1.1852 2.8417 1.1424 2.7731 3.5478 4.4184 3.1876 4.0890 2.3729 2.2968 2.2330 2.4388 2.6766 2.4311 2.6501 3.0918 4.7580 2.8332 3.0866 2.0541 1.9886 1.8933 1.4220 1.9024 1.4419 4.3155 3.4805 2.9356 3.1968 2.2762 1.8903 1.5195 1.6937 1.3676 1.3576 1.8915 1.7270 1.5127 1.6732 1.6581 1.3380 1.8084 1.2360 1.5978 1.5900 1.5354 1.5597 2.1466 1.6248 2.6772 1.3370 1.1590 1.2509 1.2602 3.1085 1.7318 1.2836 2.7875 1.5932 2.2919 1.4197 1.2860 5.2525 1.2311 1.2334 1.2378 1.1805 1.3301 1.9250 1.6300 1.1486 1.3083 1.0675 1.1216 1.0730 1.0660 1.0912 6.1291 7.4067 4.7706 4.9641 5.0308 1.0594 1.0385 1.0403 1.0557 1.0647 1.1019 1.1002 1.0955 1.0963 1.0949 1.0647 1.0978 1.0975 1.0629 1.0604 1.0871 1.0936 1.0913 1.0988 1.1139 1.1140 1.1144
irintensity: 0.0890 0.1151 0.3178 0.2060 0.0491 2.0320 0.0377 0.4892 0.4219 1.6584 0.6652 0.5425 0.7690 0.6774 1.4906 8.2587 2.4920 5.4375 0.6790 1.3561 2.9316 3.0338 2.3347 2.7835 5.3319 7.8397 1.9222 1.5240 9.0004 2.4699 10.5500 1.1706 4.4222 0.0797 36.4539 3.4169 13.0807 7.7439 4.2486 34.5316 4.4248 6.2100 4.6675 55.0451 59.8262 147.9842 3.7056 45.1707 11.6117 3.1918 1.4699 0.8828 15.0570 4.1371 10.1738 7.5448 1.3694 46.9967 3.2620 62.4693 9.1109 11.8720 11.1296 2.7040 17.4799 6.5823 0.3205 16.2705 3.3061 19.0626 6.3581 13.5774 0.1132 10.6339 39.1105 9.9437 0.2556 40.9013 18.2992 4.5313 6.0104 10.0799 18.7218 19.8386 8.4974 20.9408 6.5675 3.3651 4.1556 2.8632 33.3787 25.1375 36.0894 26.7399 30.3666 11.3461 37.8075 33.3881 9.9686 25.1096 19.0920 21.4352 20.1458 28.3918 26.5082 8.6587 11.3074 1.6606 11.0483 14.3685 29.8828 25.8683 30.2759 24.5435
temp: 298.150 k
press: 1.00000 atm
elementType: 8 6 6 6 6 6 6 6 6 6 6 6 6 6 6 6 6 6 1 1 1 1 1 1 1 1 1 1 1 1 1 1 1 1 1 1 1 1 1 1
symmnumber: 1
zpe: 885796.1 jmol-1
zpe.correction: 0.337382 hartree
zpe.thermalcorrener: 0.357476 hartree
zpe.thermalcorrenthalpy: 0.358420 hartree
zpe.thermalcorrgfe: 0.285848 hartree
zpe.sumelectzpe: -734.807663 hartree
zpe.sumelectthermal: -734.787568 hartree
zpe.sumelectthermalent: -734.786624 hartree
zpe.sumelectthermalfe: -734.859197 hartree
dipole: -0.1233 0.1687 -1.2480
dipole: 1.2653
quadrupole: -108.2457 -99.9615 -109.4831
quadrupole: 1.6164 -0.1201 -1.2591
quadrupole: -2.3489 5.9353 -3.5864 1.6164 -0.1201 -1.2591
hfenergy: -735.1450445 hartree
pointgroup: C01 [X(C17H22O1)]
dipole: -0.0438902 -0.0387122 -0.4943745 debye
polarizability: 216.5667677|-4.2225126|215.1177582|-8.0318708|4.3714568|130.4408284 unknown
InChI: InChI=1S/C17H22O/c1-6-10-18-17-15(11-13(2)3)8-7-9-16(17)12-14(4)5/h6-9H,1-2,4,10-12H2,3,5H3
charge 0 multiplicity 1
40 atoms
O  0.063908 1.390071 -0.142188
C  -1.485175 -0.45472 -0.592972
C  0.943555 -0.900852 -0.279054
C  -0.156421 -0.003946 -0.35731
C  -2.659204 0.521996 -0.595262
C  2.356883 -0.390307 0.012304
C  -1.688624 -1.842717 -0.793794
C  0.694985 -2.282117 -0.474326
C  -0.60873 -2.751584 -0.740487
C  -3.266374 0.751801 0.796079
C  3.127528 -1.236805 1.023381
C  -3.930992 -0.445218 1.450818
C  2.543977 -1.297242 2.423168
C  0.49813 2.121935 -1.367217
C  -3.21767 1.971433 1.392573
C  4.279954 -1.874905 0.685779
C  0.560971 3.585792 -1.023984
C  1.623349 4.384951 -1.287941
H  -2.339662 1.496616 -1.001735
H  -3.447258 0.120049 -1.264508
H  2.937065 -0.346351 -0.931142
H  2.272007 0.646336 0.393569
H  -2.703202 -2.207814 -0.995378
H  1.534846 -2.983796 -0.406622
H  -0.784576 -3.82103 -0.901061
H  -4.359999 -0.182766 2.432797
H  -4.7451 -0.845785 0.813759
H  -3.206704 -1.268745 1.598891
H  3.157089 -1.920938 3.095723
H  2.469576 -0.281851 2.859482
H  1.516529 -1.707935 2.404412
H  1.482428 1.746401 -1.711672
H  -0.246992 1.932099 -2.170245
H  -2.715846 2.821986 0.91739
H  -3.659887 2.146254 2.380674
H  4.693786 -1.818789 -0.328606
H  4.845854 -2.464333 1.416643
H  -0.338502 3.994946 -0.543471
H  1.608479 5.45416 -1.050543
H  2.538223 3.994814 -1.751426
