program: Gaussian 09
title: 000242808
version: EM64L-G09RevD.01
frameworkgroup: C1[X(C14H18N2O4S)]
method: RPBEPBE
basis: SDD
operation: Freq
keyword: #p
keyword: freq=noraman
keyword: PBEPBE/SDD
title: #p freq=noraman PBEPBE/SDD
converged: YES YES NO NO
title: Mulliken charges:
elementType: S O O O O N N C C C C C C C C C C C C C C H H H H H H H H H H H H H H H H H H
charge: 0.994235 -0.199672 -0.199764 -0.557083 -0.557164 -0.219255 -0.720082 -0.369544 -0.377130 -0.381241 -0.371446 -0.316232 -0.598476 0.082729 0.083365 0.178802 0.180901 -0.353628 -0.353891 -0.211268 -0.211386 0.207048 0.206909 0.222203 0.226060 0.207250 0.207904 0.241687 0.240976 0.238032 0.238225 0.278147 0.278251 0.270069 0.270043 0.239366 0.239340 0.332889 0.332831
chargesum: 0.00000
title: Mulliken charges with hydrogens summed into heavy atoms:
elementType: S O O O O N N C C C C C C C C C C C C C C
charge: 0.994235 -0.199672 -0.199764 -0.557083 -0.557164 -0.219255 -0.054362 0.044413 0.071134 0.033913 0.111217 0.160024 -0.042079 0.082729 0.083365 0.178802 0.180901 -0.083559 -0.083848 0.028098 0.027954
polarizability: 2.82000328e+02 4.02973776e-01 2.01243422e+02 -2.47666655e+01 1.07115600e+00 1.37912517e+02
1716.lowfreq: -11.6319 -4.5766 -2.2164 -0.0022 0.0011 0.0014 6.0541 12.3534 17.1619
frequency: 5.2425 12.3158 16.9374 22.8359 55.4914 58.2291 67.9006 98.9770 120.2904 129.9666 135.2602 137.5315 146.4037 168.0146 187.4729 229.2029 230.2312 240.5575 262.2131 273.5012 292.8367 310.1066 337.0364 372.4839 402.0540 410.9680 449.4849 455.7280 503.1866 522.9653 540.5228 598.7430 613.9631 658.9076 676.7630 699.9123 717.0232 734.6820 751.5955 781.0436 785.5244 795.9650 804.2579 827.5081 831.7508 870.6997 901.0097 906.8495 945.7034 961.0970 974.6354 1000.1570 1006.2880 1012.6803 1023.2802 1024.7118 1044.4114 1062.1525 1072.5961 1074.8253 1083.7684 1110.1076 1167.7562 1170.6700 1194.6238 1203.1470 1222.2957 1238.6146 1261.2995 1280.4856 1283.8858 1292.1068 1301.9381 1308.7086 1331.3654 1338.1803 1348.3381 1357.5496 1372.6387 1408.3392 1416.0785 1446.8444 1453.3723 1455.7159 1465.3881 1467.8112 1478.4730 1488.5454 1535.6084 1614.8569 1617.6516 1627.7186 1676.5281 2961.9982 2969.0992 2985.9848 2995.0942 3003.1847 3011.9000 3025.5171 3047.2738 3051.6213 3062.0719 3081.2055 3139.4988 3142.2187 3152.9586 3164.4989 3174.4837 3354.8646 3518.0928
redmass: 7.3952 6.8821 4.0846 5.7063 5.9888 3.1680 1.8780 8.9865 2.3019 1.9295 5.3438 4.9810 1.5683 8.7667 5.4863 5.1231 4.3284 2.8124 3.2199 2.3005 6.8623 8.5059 9.3662 4.7913 5.1370 3.2214 4.2341 4.8812 4.1820 7.2110 6.3428 7.0732 5.7193 4.7958 5.0100 5.3980 3.0808 1.0855 1.1720 1.3731 4.0839 1.6832 2.7208 2.6770 2.1196 2.2956 2.8272 1.3898 7.1227 1.4561 1.4131 4.7811 1.3461 2.6558 2.5847 1.9446 1.3503 3.2482 2.6675 2.5707 3.9824 1.4467 1.2074 2.0251 1.9425 2.8726 1.2211 1.4839 1.2407 1.2538 1.4408 1.0597 1.1038 1.3097 1.2292 3.2651 1.5040 1.5433 1.5667 1.1066 5.9824 1.2787 2.4621 2.0642 1.0684 1.0822 1.0926 1.0997 1.0854 7.6905 8.2005 11.1106 11.7337 1.0586 1.0590 1.0589 1.0586 1.0991 1.0582 1.1031 1.1043 1.0560 1.1048 1.1061 1.0864 1.1104 1.0906 1.0956 1.1004 1.0417 1.0994
irintensity: 2.0851 0.4552 0.0153 0.2886 4.7014 0.7376 0.7184 3.2935 1.2637 0.0199 3.0129 0.0037 45.7178 6.8734 2.4565 8.0811 0.5035 6.9282 2.5672 2.4568 27.0934 10.7352 1.0843 10.4000 25.2413 0.1885 25.4382 0.0028 161.1137 9.2680 4.8060 11.0923 8.6808 0.0149 0.2701 8.9726 73.8344 11.4043 0.3623 1.3394 0.0541 31.6861 15.8241 168.7586 0.8070 37.3258 31.4316 0.0523 11.2199 29.3095 2.2289 1.6219 0.0033 2.7185 14.7165 47.3619 3.3793 7.6669 9.9028 0.0432 1.8633 32.8513 9.4265 3.7575 4.0245 20.5506 8.4859 7.3168 7.7386 0.2028 0.2819 0.5851 0.0907 37.9807 13.9951 224.0129 92.8527 3.2918 36.9307 5.9579 10.2088 18.0109 11.4519 6.1965 1.0540 1.9405 1.2351 25.0582 25.0208 1.9169 122.4433 324.4202 42.8479 0.7596 34.3140 21.5840 17.2296 0.0134 35.3314 10.1031 19.2564 7.5831 34.3609 16.6353 1.6764 2.6772 5.2204 5.9325 21.4378 26.1601 23.0668
temp: 298.150 k
press: 1.00000 atm
elementType: 16 8 8 8 8 7 7 6 6 6 6 6 6 6 6 6 6 6 6 6 6 1 1 1 1 1 1 1 1 1 1 1 1 1 1 1 1 1 1
symmnumber: 1
zpe: 796812.6 jmol-1
zpe.correction: 0.303490 hartree
zpe.thermalcorrener: 0.325823 hartree
zpe.thermalcorrenthalpy: 0.326768 hartree
zpe.thermalcorrgfe: 0.245783 hartree
zpe.sumelectzpe: -1351.040661 hartree
zpe.sumelectthermal: -1351.018328 hartree
zpe.sumelectthermalent: -1351.017384 hartree
zpe.sumelectthermalfe: -1351.098369 hartree
dipole: -4.1173 -0.2759 4.4177
dipole: 6.0452
quadrupole: -108.8722 -146.9258 -133.5890
quadrupole: -0.5952 14.7306 -0.5293
quadrupole: 20.9234 -17.1301 -3.7933 -0.5952 14.7306 -0.5293
hfenergy: -1351.3441512 hartree
pointgroup: C01 [X(C14H18N2O4S1)]
dipole: 1.6500361 0.2298543 1.6973902 debye
polarizability: 282.8230801|1.9627196|200.7653696|22.1462784|-5.6216056|137.5678181 unknown
InChI: InChI=1S/C14H18N2O4S/c15-21(19,20)10-6-2-1-5-9-16-13(17)11-7-3-4-8-12(11)14(16)18/h3-4,7-8H,1-2,5-6,9-10,15H2
charge 0 multiplicity 1
39 atoms
S  -7.085085 0.023397 0.241479
O  2.468257 -2.428291 -0.393728
O  2.374538 2.257702 -0.850654
O  -7.321614 1.338271 -0.691099
O  -7.327325 -1.486865 -0.319871
N  2.099827 -0.103601 -0.746265
N  -8.113309 0.225857 1.773058
C  -1.769647 -0.107133 -0.678076
C  -0.330111 -0.026374 -0.125258
C  -2.836411 0.048923 0.429531
C  0.720466 -0.178945 -1.249151
C  -4.276786 -0.030466 -0.138374
C  -5.307278 0.117583 0.979818
C  2.866529 -1.237803 -0.346134
C  2.8194 1.115395 -0.575363
C  4.185565 -0.69055 0.110795
C  4.157418 0.719165 -0.026358
C  5.318232 -1.355681 0.602487
C  5.261017 1.510571 0.324033
C  6.440717 -0.563711 0.961012
C  6.412496 0.847297 0.824051
H  -1.916156 -1.078532 -1.193194
H  -1.918012 0.682797 -1.442696
H  -0.171619 -0.822512 0.627895
H  -0.177347 0.945554 0.382486
H  -2.691362 -0.742519 1.19285
H  -2.690778 1.020003 0.944815
H  0.605432 -1.157857 -1.748599
H  0.594638 0.623928 -1.998169
H  -4.420641 -1.000403 -0.651985
H  -4.424086 0.76914 -0.889589
H  -5.298155 -0.70211 1.715707
H  -5.29561 1.099367 1.479268
H  5.329059 -2.445536 0.702262
H  5.228552 2.598864 0.212633
H  7.343325 -1.047716 1.349042
H  7.293708 1.432176 1.108575
H  -8.690288 -0.626954 1.876275
H  -8.686957 1.078769 1.653592
