program: Gaussian 09
title: 000242807
version: EM64L-G09RevD.01
frameworkgroup: C1[X(C14H16ClNO4S)]
method: RPBEPBE
basis: SDD
operation: Freq
keyword: #p
keyword: freq=noraman
keyword: PBEPBE/SDD
title: #p freq=noraman PBEPBE/SDD
converged: YES YES NO NO
title: Mulliken charges:
elementType: Cl S O O O O N C C C C C C C C C C C C C C H H H H H H H H H H H H H H H H
charge: -0.209805 0.920697 -0.199392 -0.199602 -0.471432 -0.468689 -0.220688 -0.369464 -0.378036 -0.386693 -0.372480 -0.314044 -0.630985 0.083435 0.083899 0.179678 0.181124 -0.352735 -0.352969 -0.210559 -0.210551 0.209537 0.209998 0.225305 0.228446 0.214759 0.217255 0.242610 0.242340 0.243180 0.240941 0.301487 0.301073 0.270680 0.270660 0.240542 0.240478
chargesum: 0.00000
title: Mulliken charges with hydrogens summed into heavy atoms:
elementType: Cl S O O O O N C C C C C C C C C C C C C C
charge: -0.209805 0.920697 -0.199392 -0.199602 -0.471432 -0.468689 -0.220688 0.050071 0.075715 0.045322 0.112470 0.170078 -0.028425 0.083435 0.083899 0.179678 0.181124 -0.082055 -0.082309 0.029983 0.029927
polarizability: 3.20097670e+02 -2.47237434e-01 1.97283961e+02 1.52602281e+01 1.77039333e+00 1.58840599e+02
1716.lowfreq: -16.4512 -5.7578 -0.0025 0.0008 0.0016 1.1150 5.8571 11.6741 20.0218
frequency: -10.7919 11.4261 19.9978 22.2458 48.2584 61.2071 68.4274 94.8756 97.5063 122.0371 131.2139 137.9517 163.3966 165.8494 184.4942 206.0111 230.4064 233.1490 234.5552 262.0453 290.4335 334.5360 351.8010 389.9110 403.6949 424.4842 456.0491 472.4479 523.0220 539.5682 574.6417 607.0031 659.0565 677.0169 700.0227 717.2849 734.8546 750.2063 778.6010 785.6279 796.6504 832.8026 837.5013 873.8618 907.3384 937.1868 946.2771 974.7727 975.2500 994.0770 1007.2139 1012.1622 1020.1503 1032.1128 1048.7652 1070.9407 1072.7497 1078.6593 1092.6285 1168.3978 1171.0791 1193.9406 1203.8085 1222.8224 1236.6512 1259.1744 1277.5780 1284.3538 1291.2062 1299.9070 1305.8436 1332.7612 1335.5472 1341.0476 1353.8235 1374.3414 1410.3841 1416.3677 1446.3045 1453.9163 1455.6670 1465.3909 1466.9538 1476.9133 1487.0114 1614.3518 1617.9368 1627.6873 1676.0211 2965.9152 2975.6459 2988.1191 3002.3020 3009.3600 3012.5642 3032.5307 3050.7801 3053.8513 3070.6083 3082.3264 3140.6651 3146.9931 3153.8031 3165.1539 3175.2755
redmass: 12.6850 6.6992 6.6319 4.2642 8.4569 3.1679 1.9107 9.7704 8.5780 2.3639 1.9519 4.9715 9.0691 11.3879 5.4483 5.6476 4.2373 8.9440 4.8579 3.2583 6.8939 10.2308 5.9564 5.4779 3.6837 5.2041 4.8655 5.8863 7.2123 6.2959 5.9799 8.3201 4.8004 5.0045 5.4284 3.0799 1.0802 1.1701 1.3068 4.7478 1.6813 2.1497 17.4561 2.0463 1.3904 2.9128 7.1100 2.0109 1.4128 4.9362 1.3474 3.0575 2.6725 2.0824 3.4092 2.5325 2.6741 4.6437 1.2508 1.2060 2.0215 1.9324 2.8872 1.2018 1.4810 1.2222 1.2265 1.4723 1.0626 1.1044 1.2888 1.3127 1.4278 2.9928 1.4858 1.5401 1.1087 5.8676 1.2506 2.4634 2.1523 1.0685 1.0816 1.0949 1.1013 7.6601 8.1999 11.1054 11.7371 1.0586 1.0588 1.0589 1.0586 1.0997 1.0582 1.1034 1.1047 1.0561 1.1055 1.1062 1.0865 1.1112 1.0906 1.0957 1.1004
irintensity: 0.0101 0.0063 0.3682 3.8248 5.6538 0.2247 0.9810 0.7135 1.7658 0.0507 0.0023 0.0001 11.1516 1.7711 1.1857 8.4509 0.4501 3.8298 2.3832 2.8389 40.1843 2.9025 20.7777 18.0809 9.0911 33.6490 0.0023 43.3200 9.3189 2.6795 6.1809 22.7001 0.0164 0.2485 9.2861 72.2383 12.5021 0.2196 1.6733 0.0147 31.9646 1.7650 52.6628 22.7484 0.0020 11.4441 6.6268 68.7304 2.1565 13.7088 0.0003 8.3594 12.6024 40.0620 18.9249 1.7287 10.0805 14.0397 14.8175 10.5567 3.5397 4.9618 21.9350 3.3512 5.7630 25.8405 0.2750 0.3719 0.3838 0.1959 50.5201 26.0183 17.8369 332.5716 16.1178 36.5482 5.4212 10.6978 20.8638 11.8407 7.1427 3.6791 2.8980 1.0061 26.0391 1.8981 123.3977 322.3220 39.9218 6.9288 23.3159 22.6968 14.9889 0.5094 34.7155 5.8389 23.2029 3.9159 25.9977 18.3806 1.5632 0.2723 4.7319 5.5426 21.4812
temp: 298.150 k
press: 1.00000 atm
elementType: 17 16 8 8 8 8 7 6 6 6 6 6 6 6 6 6 6 6 6 6 6 1 1 1 1 1 1 1 1 1 1 1 1 1 1 1 1
symmnumber: 1
zpe: 732530.3 jmol-1
zpe.correction: 0.279006 hartree
zpe.thermalcorrener: 0.300146 hartree
zpe.thermalcorrenthalpy: 0.301090 hartree
zpe.thermalcorrgfe: 0.224325 hartree
zpe.sumelectzpe: -1755.185218 hartree
zpe.sumelectthermal: -1755.164078 hartree
zpe.sumelectthermalent: -1755.163134 hartree
zpe.sumelectthermalfe: -1755.239899 hartree
dipole: 8.8816 -0.1029 2.1648
dipole: 9.1422
quadrupole: -166.3238 -152.2325 -139.9836
quadrupole: -0.9683 6.4160 -1.2465
quadrupole: -13.4772 0.6141 12.8631 -0.9683 6.4160 -1.2465
hfenergy: -1755.4642242 hartree
pointgroup: C01 [X(C14H16Cl1N1O4S1)]
dipole: 3.5210191 0.1497627 0.7191307 debye
polarizability: 320.9224845|3.2658678|196.4637965|9.3578601|-5.9733376|158.8359486 unknown
InChI: InChI=1S/C14H16NO4S.Cl/c16-13-11-7-3-4-8-12(11)14(17)15(13)9-5-1-2-6-10-20(18)19;/h3-4,7-8H,1-2,5-6,9-10H2;
charge 0 multiplicity 1
37 atoms
Cl -8.314501 -0.036326 2.196943
S  -7.136194 -0.039499 0.067935
O  2.423245 -2.411599 -0.36525
O  2.384537 2.271187 -0.853866
O  -7.344308 -1.474417 -0.648514
O  -7.483477 1.323821 -0.729965
N  2.087767 -0.086487 -0.742016
C  -1.779024 -0.085437 -0.769872
C  -0.353981 -0.006627 -0.180236
C  -2.869601 0.051196 0.318351
C  0.722848 -0.153569 -1.280739
C  -4.296253 -0.030369 -0.29463
C  -5.335729 0.069342 0.815924
C  2.833894 -1.225301 -0.315781
C  2.814377 1.127373 -0.561242
C  4.146094 -0.687253 0.168671
C  4.134546 0.722272 0.021714
C  5.260385 -1.359416 0.691729
C  5.23694 1.505583 0.393372
C  6.381258 -0.57542 1.071689
C  6.369678 0.834841 0.924916
H  -1.909161 -1.051216 -1.299238
H  -1.912709 0.714184 -1.526666
H  -0.212862 -0.80736 0.571163
H  -0.212777 0.962541 0.335641
H  -2.739213 -0.751133 1.071958
H  -2.743587 1.016121 0.848413
H  0.616682 -1.128356 -1.79015
H  0.618682 0.656168 -2.025551
H  -4.40873 -0.988037 -0.83654
H  -4.430582 0.790732 -1.023646
H  -5.336457 -0.772351 1.526665
H  -5.370253 1.037499 1.340833
H  5.258481 -2.448612 0.798898
H  5.21738 2.593348 0.274198
H  7.269873 -1.064768 1.484373
H  7.249535 1.41295 1.226715
