program: Gaussian 09
title: 000242805
version: EM64L-G09RevD.01
frameworkgroup: C1[X(C10H22O5SSi4)]
method: RPBEPBE
basis: SDD
operation: Freq
keyword: #p
keyword: freq=noraman
keyword: PBEPBE/SDD
title: #p freq=noraman PBEPBE/SDD
converged: YES YES NO NO
title: Mulliken charges:
elementType: S Si Si Si Si O O O O O C C C C C C C C C C H H H H H H H H H H H H H H H H H H H H H H
charge: 0.027184 1.650627 1.647509 1.673001 1.453359 -0.996555 -1.008916 -0.981535 -0.987486 -0.484926 -1.047787 -1.047226 -1.050784 -1.050174 -0.519293 -0.514051 -0.486740 -0.479146 -0.101373 -0.694678 -0.075818 0.244639 0.251646 0.246287 0.251526 0.243580 0.250153 0.250090 0.253438 0.240176 0.252460 0.244249 0.249284 0.217426 0.216614 0.222724 0.231733 0.220456 0.227756 0.266217 0.245568 0.248786
chargesum: 0.00000
title: Mulliken charges with hydrogens summed into heavy atoms:
elementType: S Si Si Si Si O O O O O C C C C C C C C C C
charge: 0.027184 1.650627 1.647509 1.673001 1.377542 -0.996555 -1.008916 -0.981535 -0.987486 -0.484926 -0.305215 -0.301967 -0.307080 -0.304181 -0.301867 -0.297437 -0.032284 -0.030933 -0.101373 0.065893
polarizability: 2.54273351e+02 5.76359468e+00 2.09000823e+02 -2.95155916e+01 -2.92860849e+00 2.03917847e+02
1716.lowfreq: -58.5143 -16.1042 -12.8906 -10.6259 -7.3366 -0.0017 -0.0015 -0.0007 6.8647
frequency: -57.8875 -15.7494 -5.6384 10.1494 22.5752 34.8747 40.8886 61.1900 65.3577 69.1311 90.3661 94.4744 111.2414 112.0598 115.7150 121.2680 125.7993 129.6647 133.7218 159.8549 164.2768 169.4760 174.8713 189.3306 199.6714 205.5436 232.9975 240.6091 262.4513 298.0480 308.6387 313.2697 324.9396 345.1033 354.4451 371.7037 401.9210 437.3076 456.4053 478.5274 495.1466 500.6660 527.6962 554.9429 596.7201 620.4529 657.8178 681.9277 712.2291 721.6059 723.1117 725.6758 787.2882 793.7979 795.3022 813.0397 813.3980 842.2117 849.3181 901.0901 904.8345 908.4304 913.6160 988.4151 989.7403 991.7176 995.9457 999.4596 1005.9640 1012.5282 1014.8869 1019.9158 1049.1218 1055.6411 1074.0678 1195.8434 1251.3205 1261.2244 1267.1822 1310.4677 1311.1418 1315.6616 1316.4791 1368.2341 1409.6494 1411.1142 1438.8904 1439.4798 1439.6863 1440.7830 1446.9663 1447.7580 1448.5968 1449.7783 1451.5934 1454.8946 1608.9332 1611.6563 2240.0021 2976.5886 2991.6220 2992.4726 2993.4929 2994.5442 3052.6443 3071.3164 3072.5293 3092.0568 3094.6998 3096.3601 3097.6772 3099.0097 3100.0834 3100.4264 3101.4699 3101.5602 3102.2400 3138.0288 3177.7280 3179.8784
redmass: 1.3410 5.2017 4.0333 4.5285 4.4076 4.3546 4.4027 2.6102 3.7567 4.2870 3.0892 2.8187 1.0429 3.8954 2.3599 1.2373 1.1935 2.6565 1.0644 2.9074 2.6159 2.4460 3.6021 3.1164 3.6839 3.5786 3.5383 6.0493 5.8908 5.3995 5.0074 5.1108 7.3310 5.0192 3.9562 9.6696 3.4585 5.4108 6.9685 3.3781 5.3466 5.0358 1.6981 2.6631 5.4792 2.9267 3.8571 3.9096 3.8951 2.9238 2.2433 3.0649 3.2376 1.2769 1.2840 1.2454 1.2459 1.9927 2.0536 1.5769 1.5475 1.5036 1.5399 1.4090 1.8266 1.3670 1.1920 8.9246 1.5621 1.2807 1.0896 1.1354 8.1742 11.3858 15.9746 7.6658 4.6279 1.3312 1.3085 1.2154 1.2150 1.2003 1.2015 1.2160 1.2214 1.2225 1.0507 1.0510 1.0526 1.0538 1.0480 1.0487 1.0606 1.0479 1.0504 1.0485 4.1649 4.1241 1.0436 1.0391 1.0349 1.0348 1.0348 1.0348 1.0958 1.0595 1.0595 1.0901 1.0905 1.0982 1.0984 1.0982 1.0982 1.0980 1.0984 1.0984 1.0983 1.0971 1.1149 1.1149
irintensity: 1.0247 1.6886 0.6587 0.5741 0.0809 0.9600 0.5129 0.2179 0.0411 0.0527 0.3445 2.7133 0.0113 0.2639 0.0330 0.0636 0.1675 0.3097 0.1264 0.4352 0.1111 0.4684 1.3299 0.6897 0.2732 0.3782 1.2767 0.9386 1.0761 23.0877 32.8260 36.0175 119.9099 58.7568 47.2850 11.6886 31.9312 13.9503 85.8609 0.2185 17.7521 15.0829 43.8758 14.0146 17.2657 86.8335 40.2304 16.9392 74.4587 28.9816 3.4645 124.3101 3.5753 183.0837 275.5137 0.0197 0.0884 10.9451 300.8564 6.0041 79.0496 172.1436 6.1461 19.7126 192.9161 78.9525 13.2190 44.3335 0.3152 31.1143 11.1359 7.8147 902.7333 417.2100 1147.4935 139.2105 518.7530 0.0442 6.1318 10.9760 98.7548 84.1910 3.9321 25.5588 18.0993 20.0925 1.3968 3.0447 0.9787 0.4760 15.8958 4.1136 17.6169 0.4081 18.8173 11.0458 4.3769 2.1028 107.4725 12.5623 8.0176 7.7877 3.9575 4.7575 10.7578 12.4529 16.7727 11.4967 11.9432 3.5140 1.6494 18.3782 9.4690 24.6551 17.9454 7.4263 21.5495 7.0828 21.5005 28.0268
temp: 298.150 k
press: 1.00000 atm
elementType: 16 14 14 14 14 8 8 8 8 8 6 6 6 6 6 6 6 6 6 6 1 1 1 1 1 1 1 1 1 1 1 1 1 1 1 1 1 1 1 1 1 1
symmnumber: 1
zpe: 810047.4 jmol-1
zpe.correction: 0.308531 hartree
zpe.thermalcorrener: 0.336230 hartree
zpe.thermalcorrenthalpy: 0.337174 hartree
zpe.thermalcorrgfe: 0.247926 hartree
zpe.sumelectzpe: -2324.728113 hartree
zpe.sumelectthermal: -2324.700414 hartree
zpe.sumelectthermalent: -2324.699470 hartree
zpe.sumelectthermalfe: -2324.788717 hartree
dipole: 6.6380 0.5301 -0.3746
dipole: 6.6696
quadrupole: -185.2828 -141.4000 -149.6402
quadrupole: -2.7587 -0.6655 2.1728
quadrupole: -26.5085 17.3743 9.1341 -2.7587 -0.6655 2.1728
hfenergy: -2325.0366434 hartree
pointgroup: C01 [X(C10H22O5S1Si4)]
dipole: -2.5563163 0.421437 -0.4161117 debye
polarizability: 246.7104265|-7.9507788|209.6975113|33.9894937|-4.398271|210.7840831 unknown
InChI: InChI=1S/C10H22O5SSi4/c1-8-20(9-2)14-18(4,5)12-17(11-10(3)16)13-19(6,7)15-20/h8-9,17H,1-2H2,3-7H3
charge 0 multiplicity 1
42 atoms
S  5.207238 -0.811657 1.345083
Si -0.507667 -2.371173 -0.956806
Si 0.161244 2.313991 -0.856087
Si -1.968471 0.206442 0.61458
Si 2.033134 -0.335805 -1.64843
O  -1.424704 -1.262158 -0.050116
O  -1.053784 1.512546 0.028165
O  0.955247 -1.592094 -1.401851
O  1.310292 1.144972 -1.352461
O  3.418022 -0.532639 -0.597007
C  -1.439467 -2.809352 -2.542527
C  -0.06932 -3.849377 0.134619
C  -0.596721 3.080073 -2.410029
C  1.032032 3.543739 0.284019
C  -1.732868 0.10291 2.483889
C  -3.761443 0.447673 0.082306
C  -1.128969 1.065926 3.22977
C  -4.226071 1.571002 -0.526007
C  3.643007 -0.60503 0.758988
C  2.412595 -0.483569 1.638113
H  2.63302 -0.385884 -3.00363
H  -2.4012 -3.300119 -2.309221
H  -1.654964 -1.899219 -3.12928
H  -0.844437 -3.493923 -3.172823
H  0.452155 -3.518283 1.049696
H  -0.978631 -4.397751 0.438768
H  0.595071 -4.548612 -0.403248
H  0.183369 3.554056 -3.031968
H  -1.098953 2.307433 -3.018242
H  -1.343939 3.850694 -2.148312
H  1.846198 4.063646 -0.251254
H  0.323054 4.302902 0.659791
H  1.475361 3.026017 1.152863
H  -2.119086 -0.794488 2.992107
H  -4.46582 -0.373728 0.286421
H  -1.012585 0.975407 4.318055
H  -0.732858 1.98046 2.769341
H  -5.277605 1.683668 -0.822065
H  -3.560316 2.415076 -0.747811
H  2.684244 -0.572829 2.69842
H  1.913367 0.491503 1.475112
H  1.673033 -1.267949 1.385669
